Error map

pg_restore text dump pg_restore: error: input file appears to be a text format dump. Please use psql.

PostgreSQL · layer 5, Data

Open the full error page →

Centre: this error. First ring: errors it is linked with (7). Outer ring: what those are linked with. Colours show the layer of a request each error belongs to. Click any dot to re-centre the map on it; hover to follow its connections. The centre dot opens the error page.

pg_restore text dump — pg_restore: error: input file appears to be a text format dump. Please use psql. (PostgreSQL)pg_restore …nodemon crashed — [nodemon] app crashed - waiting for file changes before starting... (Node.js)nodemon crashedpg_dump version mismatch — pg_dump: error: aborting because of server version mismatch (PostgreSQL)pg_dump version mis…57014 — ERROR: canceling statement due to statement timeout (PostgreSQL)57014npx executable — npm ERR! could not determine executable to run (npm)npx executable2BP01 — ERROR: cannot drop table x because other objects depend on it (PostgreSQL)2BP01react-scripts not found — 'react-scripts' is not recognized as an internal or external command / react-scripts: command not found (React)react-scripts not f…08P01 — ERROR: bind message supplies 2 parameters, but prepared statement requires 1 (PostgreSQL)08P01MODULE_NOT_FOUND — Error: Cannot find module 'x' (MODULE_NOT_FOUND) (Node.js)MODULE_NOT_FOUNDEADDRINUSE — Error: listen EADDRINUSE: address already in use :::3000 (Node.js)EADDRINUSE500.30 — HTTP Error 500.30 - ASP.NET Core app failed to start (.NET)500.30504 — HTTP 504 Gateway Timeout (HTTP)504524 — Cloudflare Error 524: A Timeout Occurred (Cloudflare)524304 — HTTP 304 Not Modified (HTTP)304E401 — npm ERR! code E401 — Unable to authenticate, need: Basic realm / Incorrect or missing password (npm)E401cb() never called — npm ERR! cb() never called! (npm)cb() never calledCorepack keyid — Error: Cannot find matching keyid (Corepack signature verification) (npm)Corepack keyid1146 — MySQL ERROR 1146 (42S02): Table 'db.table' doesn't exist (MySQL)114642P01 — PostgreSQL: ERROR: relation "x" does not exist (PostgreSQL)42P0142703 — PostgreSQL: ERROR: column "x" does not exist (PostgreSQL)42703command not found — bash: command not found (Linux)command not foundCOPY failed — COPY failed: file not found in build context / "/app/x": not found (Docker)COPY failedGradle wrapper main class — Error: Could not find or load main class org.gradle.wrapper.GradleWrapperMain (Java)Gradle wrapper main…IRQL_NOT_LESS_OR_EQUAL — Blue Screen: IRQL_NOT_LESS_OR_EQUAL (Stop code 0x0000000A) (Windows)IRQL_NOT_LESS_OR_EQ…NonUniqueResultException — IncorrectResultSizeDataAccessException: query did not return a unique result: 2 (Java)NonUniqueResultExce…1093 — MySQL ERROR 1093 (HY000): You can't specify target table 'x' for update in FROM clause (MySQL)1093

Directly related (7)

Two steps away (18)

MODULE_NOT_FOUNDNode.js

Error: Cannot find module 'x' (MODULE_NOT_FOUND)

Node can’t resolve the module path — the package isn’t installed, or a relative path/extension is wrong.

EADDRINUSENode.js

Error: listen EADDRINUSE: address already in use :::3000

Another process is already listening on that port.

500.30.NET

HTTP Error 500.30 - ASP.NET Core app failed to start

IIS/Azure’s ASP.NET Core Module launched your app but it crashed during startup.

504HTTP

HTTP 504 Gateway Timeout

A proxy or gateway waited too long for the upstream server to respond and gave up.

524Cloudflare

Cloudflare Error 524: A Timeout Occurred

Cloudflare connected to the origin, but the origin didn’t send an HTTP response within 100 seconds.

304HTTP

HTTP 304 Not Modified

The cached copy is still valid, so the server sends no body and the client reuses its cache.

E401npm

npm ERR! code E401 — Unable to authenticate, need: Basic realm / Incorrect or missing password

The registry rejected your credentials — missing, expired or wrong auth token.

cb() never callednpm

npm ERR! cb() never called!

An old npm crash during install — usually network/cache corruption.

Corepack keyidnpm

Error: Cannot find matching keyid (Corepack signature verification)

An older Corepack couldn’t verify the signature of a newly published pnpm/yarn release after npm rotated its signing keys.

1146MySQL

MySQL ERROR 1146 (42S02): Table 'db.table' doesn't exist

The query references a table that MySQL can’t find in that database.

42P01PostgreSQL

PostgreSQL: ERROR: relation "x" does not exist

The table/view isn’t found — missing migration, wrong schema, or a case-sensitive quoted name.

42703PostgreSQL

PostgreSQL: ERROR: column "x" does not exist

PostgreSQL can’t find the column — a missing migration, a case-sensitive quoted name, or a string literal written in double quote…

command not foundLinux

bash: command not found

The shell can’t find an executable with that name in any directory on your PATH.

COPY failedDocker

COPY failed: file not found in build context / "/app/x": not found

The Dockerfile COPY refers to a path outside the build context, excluded by .dockerignore, or relative to the wrong directory.

Gradle wrapper main classJava

Error: Could not find or load main class org.gradle.wrapper.GradleWrapperMain

The Gradle wrapper JAR (gradle/wrapper/gradle-wrapper.jar) is missing or corrupt.

IRQL_NOT_LESS_OR_EQUALWindows

Blue Screen: IRQL_NOT_LESS_OR_EQUAL (Stop code 0x0000000A)

A driver accessed memory at an interrupt level where that’s not allowed — almost always a faulty or incompatible driver, sometime…

NonUniqueResultExceptionJava

IncorrectResultSizeDataAccessException: query did not return a unique result: 2

A query expected one row but found several.

1093MySQL

MySQL ERROR 1093 (HY000): You can't specify target table 'x' for update in FROM clause

An UPDATE/DELETE uses a subquery that reads from the same table, which MySQL doesn’t allow directly.