Error map

exec no such file or directory exec /docker-entrypoint.sh: no such file or directory (CRLF line endings / missing interpreter)

Docker · layer 6, Platform & cloud

Open the full error page →

Centre: this error. First ring: errors it is linked with (11). Outer ring: what those are linked with. Colours show the layer of a request each error belongs to. Click any dot to re-centre the map on it; hover to follow its connections. The centre dot opens the error page.

exec no such file or directory — exec /docker-entrypoint.sh: no such file or directory (CRLF line endings / missing interpreter) (Docker)exec no suc…executable file not found in $PATH — OCI runtime create failed: exec: "x": executable file not found in $PATH (Docker)executable file not…is not running — Error response from daemon: Container X is not running (Docker)is not runningACR unauthorized — Azure Container Registry: unauthorized: authentication required, visit https://aka.ms/acr/authorization (AKS ErrImagePull 401) (Azure)ACR unauthorizedContainer failed to start — Cloud Run: The user-provided container failed to start and listen on the port defined provided by the PORT=8080 environment variable (Google Cloud / Firebase)Container failed to…Conflict container name — Conflict. The container name "/x" is already in use by container … (Docker)Conflict container …exec format error — exec /usr/local/bin/docker-entrypoint.sh: exec format error (Docker)exec format errorNo such container — Error response from daemon: No such container (Docker)No such containerYou cannot remove a running container — Error response from daemon: You cannot remove a running container. Stop the container before attempting removal or force remove (Docker)You cannot remove a…status=203/EXEC — systemd: Main process exited, code=exited, status=203/EXEC (Linux)status=203/EXECexec permission denied — exec /entrypoint.sh: permission denied (container won't start) (Docker)exec permission den…Exited (0) — Docker container exits immediately (Exited (0) / Exited (1) right after start) (Docker)Exited (0)command not found — bash: command not found (Linux)command not founddocker-credential-desktop — error getting credentials - err: exec: "docker-credential-desktop": executable file not found in $PATH (Docker)docker-credential-d…CreateContainerError — Pod status CreateContainerError (Kubernetes)CreateContainerErrorport is already allocated — Docker: Bind for 0.0.0.0:80 failed: port is already allocated (Docker)port is already all…CannotPullContainerError — ECS task stopped: CannotPullContainerError: pull image manifest has been retried ... / ref pull has been retried (AWS)CannotPullContainer…Essential container in task exited — ECS: Essential container in task exited (task keeps stopping) (AWS)Essential container…CrashLoopBackOff — Kubernetes: CrashLoopBackOff (Kubernetes)CrashLoopBackOffImagePullBackOff — Kubernetes: ImagePullBackOff / ErrImagePull (Kubernetes)ImagePullBackOffEROFS — npm ERR! code EROFS — EROFS: read-only file system (npm)EROFSunhealthy — Docker container is unhealthy (health check failing) (Docker)unhealthyRestarting (1) — Docker container keeps restarting (Restarting (1) x seconds ago) (Docker)Restarting (1)RunContainerError — Pod status RunContainerError (Kubernetes)RunContainerErrordaemon — Cannot connect to the Docker daemon at unix:///var/run/docker.sock. Is the docker daemon running? (Docker)daemonCOPY failed — COPY failed: file not found in build context / "/app/x": not found (Docker)COPY failedGD missing — Fatal error: Uncaught Error: Call to undefined function imagecreatefromjpeg() (PHP)GD missingnext/image hostname — Error: Invalid src prop on `next/image`, hostname "x" is not configured under images in your `next.config.js` (React)next/image hostnamedocker-compose: command not found — docker-compose: command not found / 'compose' is not a docker command (Docker)docker-compose: com…the input device is not a TTY — the input device is not a TTY (Docker)the input device is…This does not seem to be a WordPress installation — WP-CLI: Error: This does not seem to be a WordPress installation. Pass --path=`path/to/wordpress` or run `wp core download` (WordPress)This does not seem …invalid reference format — docker: invalid reference format (repository name must be lowercase) (Docker)invalid reference f…client version is too new — Error response from daemon: client version 1.45 is too new. Maximum supported API version is 1.41 (Docker)client version is t…could not select device driver — could not select device driver "" with capabilities: [[gpu]] (Docker)could not select de…Job for x.service failed — Job for nginx.service failed because the control process exited with error code (Linux)Job for x.service f…Unit not found — Failed to start x.service: Unit x.service not found (Linux)Unit not foundSystem has not been booted with systemd — System has not been booted with systemd as init system (PID 1). Can't operate. (Linux)System has not been…EACCES — npm ERR! code EACCES — permission denied (npm)EACCESEACCES — Linux: Permission denied (Linux)EACCESinvalid_scope — OAuth 2.0 Error: invalid_scope / insufficient_scope (Authentication)invalid_scope500.30 — HTTP Error 500.30 - ASP.NET Core app failed to start (.NET)500.30ExceptionInInitializerError — java.lang.ExceptionInInitializerError (Java)ExceptionInInitiali…MySQL won't start — Job for mysql.service failed because the control process exited with error code (MySQL)MySQL won't start

Directly related (11)

executable file not found in $PATHDocker

OCI runtime create failed: exec: "x": executable file not found in $PATH

The command you asked the container to run doesn’t exist inside the image — wrong command name, a shell that isn’t installed (bas…

is not runningDocker

Error response from daemon: Container X is not running

You tried to exec into or interact with a container that has stopped.

ACR unauthorizedAzure

Azure Container Registry: unauthorized: authentication required, visit https://aka.ms/acr/authorization (AKS ErrImagePull 401)

Pulling/pushing to ACR wasn’t authenticated — Docker not logged in, or AKS/App Service lacks AcrPull on the registry.

Container failed to startGoogle Cloud / Firebase

Cloud Run: The user-provided container failed to start and listen on the port defined provided by the PORT=8080 environment variable

Cloud Run started your container, but nothing listened on $PORT within the startup timeout — the app crashed, listens on another…

Conflict container nameDocker

Conflict. The container name "/x" is already in use by container …

A container (running or stopped) already has that name; Docker won’t create a second one with the same name.

exec format errorDocker

exec /usr/local/bin/docker-entrypoint.sh: exec format error

The container tried to run a binary built for a different CPU architecture (arm64 vs amd64) — or a script with a broken shebang /…

No such containerDocker

Error response from daemon: No such container

The container name or ID you used doesn’t exist on this Docker host — it was removed, has another name, or you’re talking to a di…

You cannot remove a running containerDocker

Error response from daemon: You cannot remove a running container. Stop the container before attempting removal or force remove

docker rm refuses to delete a container that is still running.

status=203/EXECLinux

systemd: Main process exited, code=exited, status=203/EXEC

systemd couldn’t execute the ExecStart command — the path is wrong, the file isn’t executable, or its interpreter is missing.

exec permission deniedDocker

exec /entrypoint.sh: permission denied (container won't start)

The entrypoint or command isn’t marked executable inside the image, or it’s on a volume mounted noexec.

Exited (0)Docker

Docker container exits immediately (Exited (0) / Exited (1) right after start)

The container started and its main process finished at once, so the container stopped — Docker containers only live as long as PI…

Two steps away (31)

command not foundLinux

bash: command not found

The shell can’t find an executable with that name in any directory on your PATH.

docker-credential-desktopDocker

error getting credentials - err: exec: "docker-credential-desktop": executable file not found in $PATH

~/.docker/config.json tells Docker to use a credential helper (desktop, osxkeychain, wincred) that isn’t installed or on PATH.

CreateContainerErrorKubernetes

Pod status CreateContainerError

The image was pulled, but the container runtime failed to create the container — bad command, missing mount target, or a name/vol…

port is already allocatedDocker

Docker: Bind for 0.0.0.0:80 failed: port is already allocated

Another container or host process already publishes that host port.

CannotPullContainerErrorAWS

ECS task stopped: CannotPullContainerError: pull image manifest has been retried ... / ref pull has been retried

The ECS task couldn’t pull its image — no network route to the registry, missing ECR permissions, or a wrong image tag.

Essential container in task exitedAWS

ECS: Essential container in task exited (task keeps stopping)

The main (essential) container stopped, so ECS stopped the whole task and the service keeps replacing it.

CrashLoopBackOffKubernetes

Kubernetes: CrashLoopBackOff

The container starts, crashes (or exits), and Kubernetes keeps restarting it with increasing back-off delays.

ImagePullBackOffKubernetes

Kubernetes: ImagePullBackOff / ErrImagePull

The node can’t pull the container image — wrong name/tag, missing registry credentials, or registry unreachable.

EROFSnpm

npm ERR! code EROFS — EROFS: read-only file system

npm tried to write to a read-only location (read-only container filesystem, mounted volume, or system path).

unhealthyDocker

Docker container is unhealthy (health check failing)

The container is running, but its HEALTHCHECK command keeps failing, so Docker (and dependent services) consider it unhealthy.

Restarting (1)Docker

Docker container keeps restarting (Restarting (1) x seconds ago)

The container crashes on start and its restart policy (always/unless-stopped/on-failure) starts it again in a loop.

RunContainerErrorKubernetes

Pod status RunContainerError

The container was created but failed to start — usually an invalid command/entrypoint, missing interpreter, or permission problem…

daemonDocker

Cannot connect to the Docker daemon at unix:///var/run/docker.sock. Is the docker daemon running?

The docker CLI can’t talk to the Docker engine — it isn’t running, or your user can’t access the socket.

COPY failedDocker

COPY failed: file not found in build context / "/app/x": not found

The Dockerfile COPY refers to a path outside the build context, excluded by .dockerignore, or relative to the wrong directory.

GD missingPHP

Fatal error: Uncaught Error: Call to undefined function imagecreatefromjpeg()

The GD extension (or its JPEG/WebP support) isn’t installed for the PHP version serving the site.

next/image hostnameReact

Error: Invalid src prop on `next/image`, hostname "x" is not configured under images in your `next.config.js`

next/image refuses to optimize images from domains not allowed in next.config.js.

docker-compose: command not foundDocker

docker-compose: command not found / 'compose' is not a docker command

Your system has only one of the two Compose flavours: the old docker-compose (v1) binary or the newer docker compose (v2) plugin.

the input device is not a TTYDocker

the input device is not a TTY

docker run/exec was called with -t (allocate a terminal) in a context with no terminal — CI, cron, a pipe or a script.

This does not seem to be a WordPress installationWordPress

WP-CLI: Error: This does not seem to be a WordPress installation. Pass --path=`path/to/wordpress` or run `wp core download`

WP-CLI couldn’t find WordPress in the current directory (or the --path given).

invalid reference formatDocker

docker: invalid reference format (repository name must be lowercase)

Docker couldn’t parse the image name — uppercase letters, spaces, an empty variable, or a misplaced option.

client version is too newDocker

Error response from daemon: client version 1.45 is too new. Maximum supported API version is 1.41

Your Docker CLI (or SDK) speaks a newer API version than the Docker daemon it’s talking to.

could not select device driverDocker

could not select device driver "" with capabilities: [[gpu]]

docker run --gpus was used, but the NVIDIA Container Toolkit isn’t installed/configured, so Docker can’t expose the GPU.

Job for x.service failedLinux

Job for nginx.service failed because the control process exited with error code

systemd tried to start the service, but its start command failed. The real reason is in the service’s status/journal.

Unit not foundLinux

Failed to start x.service: Unit x.service not found

systemd has no unit with that name — the package isn’t installed, the name differs on this distro, or a new unit file wasn’t load…

System has not been booted with systemdLinux

System has not been booted with systemd as init system (PID 1). Can't operate.

You ran systemctl inside an environment without systemd as PID 1 — a Docker container or older WSL.

EACCESnpm

npm ERR! code EACCES — permission denied

npm can’t write to a directory — usually global installs into a root-owned folder.

EACCESLinux

Linux: Permission denied

Your user (or the service user) lacks read/write/execute permission on a file, directory or one of its parents.

invalid_scopeAuthentication

OAuth 2.0 Error: invalid_scope / insufficient_scope

The requested scope is unknown or not allowed for this client — or the token lacks the scope the API endpoint requires.

500.30.NET

HTTP Error 500.30 - ASP.NET Core app failed to start

IIS/Azure’s ASP.NET Core Module launched your app but it crashed during startup.

ExceptionInInitializerErrorJava

java.lang.ExceptionInInitializerError

A static initializer (static block or static field) threw an exception while the class was loading.

MySQL won't startMySQL

Job for mysql.service failed because the control process exited with error code

The MySQL/MariaDB service failed to start — the real reason is in the MySQL error log.