Error map

This does not seem to be a WordPress installation WP-CLI: Error: This does not seem to be a WordPress installation. Pass --path=`path/to/wordpress` or run `wp core download`

WordPress · layer 4, Application & API

Open the full error page →

Centre: this error. First ring: errors it is linked with (7). Outer ring: what those are linked with. Colours show the layer of a request each error belongs to. Click any dot to re-centre the map on it; hover to follow its connections. The centre dot opens the error page.

This does not seem to be a WordPress installation — WP-CLI: Error: This does not seem to be a WordPress installation. Pass --path=`path/to/wordpress` or run `wp core download` (WordPress)This does n…There doesn't seem to be a wp-config.php file — WordPress: There doesn't seem to be a wp-config.php file. I need this before we can get started (WordPress)There doesn't seem …is not running — Error response from daemon: Container X is not running (Docker)is not runningdocker-compose: command not found — docker-compose: command not found / 'compose' is not a docker command (Docker)docker-compose: com…the input device is not a TTY — the input device is not a TTY (Docker)the input device is…invalid reference format — docker: invalid reference format (repository name must be lowercase) (Docker)invalid reference f…No such container — Error response from daemon: No such container (Docker)No such containerYou cannot remove a running container — Error response from daemon: You cannot remove a running container. Stop the container before attempting removal or force remove (Docker)You cannot remove a…DB connection — WordPress: Error Establishing a Database Connection (WordPress)DB connectionPython not found — Python was not found; run without arguments to install from the Microsoft Store (Python)Python not foundapi_version_invalid — API Error: Invalid or unsupported API version (API)api_version_invalidport is already allocated — Docker: Bind for 0.0.0.0:80 failed: port is already allocated (Docker)port is already all…Conflict container name — Conflict. The container name "/x" is already in use by container … (Docker)Conflict container …CannotPullContainerError — ECS task stopped: CannotPullContainerError: pull image manifest has been retried ... / ref pull has been retried (AWS)CannotPullContainer…not a git repository — fatal: not a git repository (or any of the parent directories): .git (Git)not a git repositorycommand not found — bash: command not found (Linux)command not foundcompose validation — docker compose: services.x Additional property y is not allowed / yaml: line N: mapping values are not allowed (Docker)compose validationshallow update not allowed — ! [remote rejected] main -> main (shallow update not allowed) (Git)shallow update not …github-actions[bot] 403 — remote: Permission to owner/repo.git denied to github-actions[bot]. fatal: unable to access … The requested URL returned error: 403 (Git)github-actions[bot]…npm ci out of sync — npm ERR! `npm ci` can only install packages when your package.json and package-lock.json are in sync (npm)npm ci out of syncexec format error — exec /usr/local/bin/docker-entrypoint.sh: exec format error (Docker)exec format errorGD missing — Fatal error: Uncaught Error: Call to undefined function imagecreatefromjpeg() (PHP)GD missingnext/image hostname — Error: Invalid src prop on `next/image`, hostname "x" is not configured under images in your `next.config.js` (React)next/image hostnameexec no such file or directory — exec /docker-entrypoint.sh: no such file or directory (CRLF line endings / missing interpreter) (Docker)exec no such file o…Exited (0) — Docker container exits immediately (Exited (0) / Exited (1) right after start) (Docker)Exited (0)unhealthy — Docker container is unhealthy (health check failing) (Docker)unhealthyEROFS — npm ERR! code EROFS — EROFS: read-only file system (npm)EROFSEssential container in task exited — ECS: Essential container in task exited (task keeps stopping) (AWS)Essential container…executable file not found in $PATH — OCI runtime create failed: exec: "x": executable file not found in $PATH (Docker)executable file not…

Directly related (7)

Two steps away (21)

DB connectionWordPress

WordPress: Error Establishing a Database Connection

WordPress can’t connect to its MySQL/MariaDB database with the credentials in wp-config.php, or the database server is down.

Python not foundPython

Python was not found; run without arguments to install from the Microsoft Store

Windows ran the Microsoft Store “App execution alias” instead of a real Python installation.

api_version_invalidAPI

API Error: Invalid or unsupported API version

The API version you requested — in the URL, a header or the SDK config — doesn’t exist or has been retired.

port is already allocatedDocker

Docker: Bind for 0.0.0.0:80 failed: port is already allocated

Another container or host process already publishes that host port.

Conflict container nameDocker

Conflict. The container name "/x" is already in use by container …

A container (running or stopped) already has that name; Docker won’t create a second one with the same name.

CannotPullContainerErrorAWS

ECS task stopped: CannotPullContainerError: pull image manifest has been retried ... / ref pull has been retried

The ECS task couldn’t pull its image — no network route to the registry, missing ECR permissions, or a wrong image tag.

not a git repositoryGit

fatal: not a git repository (or any of the parent directories): .git

You ran a Git command outside a Git working tree.

command not foundLinux

bash: command not found

The shell can’t find an executable with that name in any directory on your PATH.

compose validationDocker

docker compose: services.x Additional property y is not allowed / yaml: line N: mapping values are not allowed

The compose file is invalid YAML or uses a key Compose doesn’t recognise at that level (usually an indentation mistake).

shallow update not allowedGit

! [remote rejected] main -> main (shallow update not allowed)

You pushed from a shallow clone to a remote that doesn’t accept shallow history.

github-actions[bot] 403Git

remote: Permission to owner/repo.git denied to github-actions[bot]. fatal: unable to access … The requested URL returned error: 403

A GitHub Actions workflow tried to push but the GITHUB_TOKEN doesn’t have write permission.

npm ci out of syncnpm

npm ERR! `npm ci` can only install packages when your package.json and package-lock.json are in sync

package-lock.json doesn’t match package.json, so npm ci refuses to install.

exec format errorDocker

exec /usr/local/bin/docker-entrypoint.sh: exec format error

The container tried to run a binary built for a different CPU architecture (arm64 vs amd64) — or a script with a broken shebang /…

GD missingPHP

Fatal error: Uncaught Error: Call to undefined function imagecreatefromjpeg()

The GD extension (or its JPEG/WebP support) isn’t installed for the PHP version serving the site.

next/image hostnameReact

Error: Invalid src prop on `next/image`, hostname "x" is not configured under images in your `next.config.js`

next/image refuses to optimize images from domains not allowed in next.config.js.

exec no such file or directoryDocker

exec /docker-entrypoint.sh: no such file or directory (CRLF line endings / missing interpreter)

The entrypoint file exists, but the kernel can’t run it — almost always Windows CRLF line endings in the script, or a shebang poi…

Exited (0)Docker

Docker container exits immediately (Exited (0) / Exited (1) right after start)

The container started and its main process finished at once, so the container stopped — Docker containers only live as long as PI…

unhealthyDocker

Docker container is unhealthy (health check failing)

The container is running, but its HEALTHCHECK command keeps failing, so Docker (and dependent services) consider it unhealthy.

EROFSnpm

npm ERR! code EROFS — EROFS: read-only file system

npm tried to write to a read-only location (read-only container filesystem, mounted volume, or system path).

Essential container in task exitedAWS

ECS: Essential container in task exited (task keeps stopping)

The main (essential) container stopped, so ECS stopped the whole task and the service keeps replacing it.

executable file not found in $PATHDocker

OCI runtime create failed: exec: "x": executable file not found in $PATH

The command you asked the container to run doesn’t exist inside the image — wrong command name, a shell that isn’t installed (bas…