Error map

status=203/EXEC systemd: Main process exited, code=exited, status=203/EXEC

Linux · layer 6, Platform & cloud

Open the full error page →

Centre: this error. First ring: errors it is linked with (9). Outer ring: what those are linked with. Colours show the layer of a request each error belongs to. Click any dot to re-centre the map on it; hover to follow its connections. The centre dot opens the error page.

status=203/EXEC — systemd: Main process exited, code=exited, status=203/EXEC (Linux)status=203/…Start request repeated too quickly — systemd: Start request repeated too quickly / service hit its start limit (Linux)Start request repea…System has not been booted with systemd — System has not been booted with systemd as init system (PID 1). Can't operate. (Linux)System has not been…Failed to connect to bus — Failed to connect to bus: No such file or directory (systemctl --user / timedatectl) (Linux)Failed to connect t…avc: denied — SELinux is preventing ... / avc: denied { read } for pid=... (permission denied despite correct permissions) (Linux)avc: deniedstartForeground not called — Context.startForegroundService() did not then call Service.startForeground() / ForegroundServiceStartNotAllowedException (Android)startForeground not…Job for x.service failed — Job for nginx.service failed because the control process exited with error code (Linux)Job for x.service f…exec no such file or directory — exec /docker-entrypoint.sh: no such file or directory (CRLF line endings / missing interpreter) (Docker)exec no such file o…0x80070422 — Windows Update error 0x80070422 (service is disabled) (Windows)0x80070422Unit not found — Failed to start x.service: Unit x.service not found (Linux)Unit not foundRestarting (1) — Docker container keeps restarting (Restarting (1) x seconds ago) (Docker)Restarting (1)provided port is not in the valid range — spec.ports[0].nodePort: Invalid value: 80: provided port is not in the valid range. The range of valid ports is 30000-32767 (Kubernetes)provided port is no…CannotPullContainerError — ECS task stopped: CannotPullContainerError: pull image manifest has been retried ... / ref pull has been retried (AWS)CannotPullContainer…Exited (0) — Docker container exits immediately (Exited (0) / Exited (1) right after start) (Docker)Exited (0)ACR unauthorized — Azure Container Registry: unauthorized: authentication required, visit https://aka.ms/acr/authorization (AKS ErrImagePull 401) (Azure)ACR unauthorizedAuthentication token manipulation error — passwd: Authentication token manipulation error (Linux)Authentication toke…AADSTS50034 — AADSTS50034: The user account does not exist in the directory (Azure)AADSTS50034AADSTS50057 — AADSTS50057: The user account is disabled (Azure)AADSTS50057EACCES — Linux: Permission denied (Linux)EACCESwebhook signature — Webhook signature verification failed (Stripe, Razorpay, GitHub…) (API)webhook signaturesudoers — user is not in the sudoers file. This incident will be reported. (Linux)sudoersno endpoints — Service has no endpoints (no endpoints available for service / Endpoints: <none>) (Kubernetes)no endpointsSecurityException: Permission Denial — java.lang.SecurityException: Permission Denial ... requires android.permission.X (Android)SecurityException: …FLAG_IMMUTABLE or FLAG_MUTABLE — Targeting S+ (version 31 and above) requires that one of FLAG_IMMUTABLE or FLAG_MUTABLE be specified when creating a PendingIntent (Android)FLAG_IMMUTABLE or F…bind() failed (98: Address already in use) — nginx: [emerg] bind() to 0.0.0.0:80 failed (98: Address already in use) (Linux)bind() failed (98: …nginx: [emerg] unknown directive — Nginx: nginx: [emerg] unknown directive "x" in /etc/nginx/sites-enabled/x:12 — configuration file test failed (Nginx / Apache)nginx: [emerg] unkn…exec format error — exec /usr/local/bin/docker-entrypoint.sh: exec format error (Docker)exec format errorConflict container name — Conflict. The container name "/x" is already in use by container … (Docker)Conflict container …executable file not found in $PATH — OCI runtime create failed: exec: "x": executable file not found in $PATH (Docker)executable file not…0x80070005 — Windows Error 0x80070005 (E_ACCESSDENIED): Access is denied (Windows)0x800700050x80070002 — Windows Error 0x80070002: The system cannot find the file specified (Windows)0x800700020x80070643 — Windows Error 0x80070643: Fatal error during installation (Windows)0x80070643command not found — bash: command not found (Linux)command not found

Directly related (9)

Start request repeated too quicklyLinux

systemd: Start request repeated too quickly / service hit its start limit

The service crashed and restarted several times in a short period, so systemd stopped trying (StartLimitBurst).

System has not been booted with systemdLinux

System has not been booted with systemd as init system (PID 1). Can't operate.

You ran systemctl inside an environment without systemd as PID 1 — a Docker container or older WSL.

Failed to connect to busLinux

Failed to connect to bus: No such file or directory (systemctl --user / timedatectl)

The command needs the D-Bus/systemd bus, which isn’t available in this session — common over su, sudo -u, cron, containers or WSL.

avc: deniedLinux

SELinux is preventing ... / avc: denied { read } for pid=... (permission denied despite correct permissions)

SELinux blocked the access — file permissions look fine, but the file’s security context or a boolean doesn’t allow the service t…

startForeground not calledAndroid

Context.startForegroundService() did not then call Service.startForeground() / ForegroundServiceStartNotAllowedException

A foreground service didn’t call startForeground() within a few seconds, or the app tried to start one from the background where…

Job for x.service failedLinux

Job for nginx.service failed because the control process exited with error code

systemd tried to start the service, but its start command failed. The real reason is in the service’s status/journal.

exec no such file or directoryDocker

exec /docker-entrypoint.sh: no such file or directory (CRLF line endings / missing interpreter)

The entrypoint file exists, but the kernel can’t run it — almost always Windows CRLF line endings in the script, or a shebang poi…

0x80070422Windows

Windows Update error 0x80070422 (service is disabled)

Windows Update (or the Microsoft Store/Defender) can’t run because a required service — usually Windows Update (wuauserv) — is di…

Unit not foundLinux

Failed to start x.service: Unit x.service not found

systemd has no unit with that name — the package isn’t installed, the name differs on this distro, or a new unit file wasn’t load…

Two steps away (23)

Restarting (1)Docker

Docker container keeps restarting (Restarting (1) x seconds ago)

The container crashes on start and its restart policy (always/unless-stopped/on-failure) starts it again in a loop.

provided port is not in the valid rangeKubernetes

spec.ports[0].nodePort: Invalid value: 80: provided port is not in the valid range. The range of valid ports is 30000-32767

A NodePort Service asked for a port outside the cluster’s NodePort range (default 30000–32767).

CannotPullContainerErrorAWS

ECS task stopped: CannotPullContainerError: pull image manifest has been retried ... / ref pull has been retried

The ECS task couldn’t pull its image — no network route to the registry, missing ECR permissions, or a wrong image tag.

Exited (0)Docker

Docker container exits immediately (Exited (0) / Exited (1) right after start)

The container started and its main process finished at once, so the container stopped — Docker containers only live as long as PI…

ACR unauthorizedAzure

Azure Container Registry: unauthorized: authentication required, visit https://aka.ms/acr/authorization (AKS ErrImagePull 401)

Pulling/pushing to ACR wasn’t authenticated — Docker not logged in, or AKS/App Service lacks AcrPull on the registry.

Authentication token manipulation errorLinux

passwd: Authentication token manipulation error

passwd couldn’t update the password — the root filesystem is read-only, /etc/shadow has wrong permissions/attributes, or a PAM ru…

AADSTS50034Azure

AADSTS50034: The user account does not exist in the directory

There’s no user with that sign-in name in the tenant.

AADSTS50057Azure

AADSTS50057: The user account is disabled

The account exists but is blocked from signing in.

EACCESLinux

Linux: Permission denied

Your user (or the service user) lacks read/write/execute permission on a file, directory or one of its parents.

webhook signatureAPI

Webhook signature verification failed (Stripe, Razorpay, GitHub…)

Your endpoint computed a different HMAC signature than the one the provider sent, so the webhook is rejected.

sudoersLinux

user is not in the sudoers file. This incident will be reported.

Your account isn’t allowed to use sudo.

no endpointsKubernetes

Service has no endpoints (no endpoints available for service / Endpoints: <none>)

The Service’s selector matches no ready pods, so traffic to it is refused or returns 503.

SecurityException: Permission DenialAndroid

java.lang.SecurityException: Permission Denial ... requires android.permission.X

The app called an API that needs a permission it hasn’t declared or the user hasn’t granted at runtime.

FLAG_IMMUTABLE or FLAG_MUTABLEAndroid

Targeting S+ (version 31 and above) requires that one of FLAG_IMMUTABLE or FLAG_MUTABLE be specified when creating a PendingIntent

Apps targeting Android 12+ must declare PendingIntent mutability; missing flags crash.

bind() failed (98: Address already in use)Linux

nginx: [emerg] bind() to 0.0.0.0:80 failed (98: Address already in use)

Nginx (or another server) can’t listen on the port because another process already holds it — often Apache, another Nginx, or a s…

nginx: [emerg] unknown directiveNginx / Apache

Nginx: nginx: [emerg] unknown directive "x" in /etc/nginx/sites-enabled/x:12 — configuration file test failed

Nginx found a directive it doesn’t know — a typo, a missing semicolon on the previous line, a directive from a module that isn’t…

exec format errorDocker

exec /usr/local/bin/docker-entrypoint.sh: exec format error

The container tried to run a binary built for a different CPU architecture (arm64 vs amd64) — or a script with a broken shebang /…

Conflict container nameDocker

Conflict. The container name "/x" is already in use by container …

A container (running or stopped) already has that name; Docker won’t create a second one with the same name.

executable file not found in $PATHDocker

OCI runtime create failed: exec: "x": executable file not found in $PATH

The command you asked the container to run doesn’t exist inside the image — wrong command name, a shell that isn’t installed (bas…

0x80070005Windows

Windows Error 0x80070005 (E_ACCESSDENIED): Access is denied

Windows refused an operation because the account or process lacks permission — seen in Windows Update, installers, Task Scheduler…

0x80070002Windows

Windows Error 0x80070002: The system cannot find the file specified

A file or registry entry Windows expected is missing — common in Windows Update, backups and app installs.

0x80070643Windows

Windows Error 0x80070643: Fatal error during installation

An MSI-based installer or update (often Defender definitions, .NET or the WinRE update KB5034441) failed during installation.

command not foundLinux

bash: command not found

The shell can’t find an executable with that name in any directory on your PATH.