Error map

exec permission denied exec /entrypoint.sh: permission denied (container won't start)

Docker · layer 6, Platform & cloud

Open the full error page →

Centre: this error. First ring: errors it is linked with (12). Outer ring: what those are linked with. Colours show the layer of a request each error belongs to. Click any dot to re-centre the map on it; hover to follow its connections. The centre dot opens the error page.

exec permission denied — exec /entrypoint.sh: permission denied (container won't start) (Docker)exec permis…EACCES — Linux: Permission denied (Linux)EACCES0x80070005 — Windows Error 0x80070005 (E_ACCESSDENIED): Access is denied (Windows)0x80070005readonly database — sqlite3.OperationalError: attempt to write a readonly database (SQL)readonly databaseOperation not permitted (macOS privacy) — macOS: Operation not permitted — Terminal/app lacks Full Disk Access (TCC privacy protection) (macOS)Operation not permi…daemon — Cannot connect to the Docker daemon at unix:///var/run/docker.sock. Is the docker daemon running? (Docker)daemonsession save path — Warning: session_start(): open(/var/lib/php/sessions/sess_x, O_RDWR) failed: Permission denied (PHP)session save pathexecutable file not found in $PATH — OCI runtime create failed: exec: "x": executable file not found in $PATH (Docker)executable file not…invalid_scope — OAuth 2.0 Error: invalid_scope / insufficient_scope (Authentication)invalid_scopeAccessDeniedException — java.nio.file.AccessDeniedException: /path (Java)AccessDeniedExcepti…listen EACCES — Error: listen EACCES: permission denied 0.0.0.0:80 (Node.js)listen EACCESACR unauthorized — Azure Container Registry: unauthorized: authentication required, visit https://aka.ms/acr/authorization (AKS ErrImagePull 401) (Azure)ACR unauthorizedAccess to the path is denied — System.UnauthorizedAccessException: Access to the path 'x' is denied (.NET)Access to the path …publickey — Git: Permission denied (publickey). fatal: Could not read from remote repository. (Git)publickeyEACCES — npm ERR! code EACCES — permission denied (npm)EACCESENOSPC — no space left on device (Docker / Linux) (Docker)ENOSPC403 — HTTP 403 Forbidden (HTTP)4030x80070002 — Windows Error 0x80070002: The system cannot find the file specified (Windows)0x800700020x80004005 — Windows Error 0x80004005 (E_FAIL): Unspecified error (Windows)0x80004005SQLITE_BUSY — sqlite3.OperationalError: database is locked (SQLITE_BUSY) (SQL)SQLITE_BUSYSQLite no such column — sqlite3.OperationalError: no such column: x (SQL)SQLite no such colu…SQLite UNIQUE failed — sqlite3.IntegrityError: UNIQUE constraint failed: users.email (SQL)SQLite UNIQUE failedsudoers — user is not in the sudoers file. This incident will be reported. (Linux)sudoersNot allowed — WordPress: Sorry, you are not allowed to access this page. (WordPress)Not allowedEPERM — Error: EPERM: operation not permitted, rename / unlink (Node.js)EPERM2002 — MySQL ERROR 2002 (HY000): Can't connect to local MySQL server through socket (MySQL)2002port is already allocated — Docker: Bind for 0.0.0.0:80 failed: port is already allocated (Docker)port is already all…ENOTFOUND — Error: getaddrinfo ENOTFOUND host / Name or service not known (API)ENOTFOUNDExpiredToken — AWS: ExpiredToken — The security token included in the request is expired (AWS)ExpiredToken401 — HTTP 401 Unauthorized (HTTP)401session_start() — Warning: session_start(): Session cannot be started after headers have already been sent (PHP)session_start()command not found — bash: command not found (Linux)command not foundConflict container name — Conflict. The container name "/x" is already in use by container … (Docker)Conflict container …exec no such file or directory — exec /docker-entrypoint.sh: no such file or directory (CRLF line endings / missing interpreter) (Docker)exec no such file o…invalid_grant — OAuth 2.0 Error: invalid_grant (Authentication)invalid_grantinvalid_client — OAuth 2.0 Error: invalid_client (Authentication)invalid_clientclipboard write blocked — NotAllowedError: Failed to execute 'writeText' on 'Clipboard': Document is not focused. (JavaScript)clipboard write blo…StringIndexOutOfBoundsException — java.lang.StringIndexOutOfBoundsException: begin 0, end 10, length 5 (Java)StringIndexOutOfBou…ArithmeticException — java.lang.ArithmeticException: / by zero (Java)ArithmeticExceptionUnsupportedOperationException — java.lang.UnsupportedOperationException (List.of / Arrays.asList is immutable) (Java)UnsupportedOperatio…EADDRINUSE — Error: listen EADDRINUSE: address already in use :::3000 (Node.js)EADDRINUSEUnhandled 'error' event — Error: Unhandled 'error' event (events.js / node:events) (Node.js)Unhandled 'error' e…spawn EACCES — Error: spawn EACCES (Node.js)spawn EACCESCrashLoopBackOff — Kubernetes: CrashLoopBackOff (Kubernetes)CrashLoopBackOffImagePullBackOff — Kubernetes: ImagePullBackOff / ErrImagePull (Kubernetes)ImagePullBackOffEROFS — npm ERR! code EROFS — EROFS: read-only file system (npm)EROFSENOENT — Error: ENOENT: no such file or directory (Node.js)ENOENTFileNotFoundException — java.io.FileNotFoundException: config.properties (No such file or directory) (Java)FileNotFoundExcepti…NoSuchFileException — java.nio.file.NoSuchFileException: /path/file (Java)NoSuchFileException

Directly related (12)

EACCESLinux

Linux: Permission denied

Your user (or the service user) lacks read/write/execute permission on a file, directory or one of its parents.

0x80070005Windows

Windows Error 0x80070005 (E_ACCESSDENIED): Access is denied

Windows refused an operation because the account or process lacks permission — seen in Windows Update, installers, Task Scheduler…

readonly databaseSQL

sqlite3.OperationalError: attempt to write a readonly database

The process can’t write to the SQLite file or its directory.

Operation not permitted (macOS privacy)macOS

macOS: Operation not permitted — Terminal/app lacks Full Disk Access (TCC privacy protection)

macOS privacy protection (TCC) blocked access to protected folders (Desktop, Documents, Downloads, Mail, Photos, external volumes…

daemonDocker

Cannot connect to the Docker daemon at unix:///var/run/docker.sock. Is the docker daemon running?

The docker CLI can’t talk to the Docker engine — it isn’t running, or your user can’t access the socket.

session save pathPHP

Warning: session_start(): open(/var/lib/php/sessions/sess_x, O_RDWR) failed: Permission denied

PHP can’t write session files to the configured session.save_path.

executable file not found in $PATHDocker

OCI runtime create failed: exec: "x": executable file not found in $PATH

The command you asked the container to run doesn’t exist inside the image — wrong command name, a shell that isn’t installed (bas…

invalid_scopeAuthentication

OAuth 2.0 Error: invalid_scope / insufficient_scope

The requested scope is unknown or not allowed for this client — or the token lacks the scope the API endpoint requires.

AccessDeniedExceptionJava

java.nio.file.AccessDeniedException: /path

The OS denied a file operation to the Java process.

listen EACCESNode.js

Error: listen EACCES: permission denied 0.0.0.0:80

Node isn’t allowed to bind that port — ports below 1024 need root on Linux/macOS, and some Windows ports are reserved.

ACR unauthorizedAzure

Azure Container Registry: unauthorized: authentication required, visit https://aka.ms/acr/authorization (AKS ErrImagePull 401)

Pulling/pushing to ACR wasn’t authenticated — Docker not logged in, or AKS/App Service lacks AcrPull on the registry.

Access to the path is denied.NET

System.UnauthorizedAccessException: Access to the path 'x' is denied

The process’s identity can’t read/write that file or folder — IIS app pool identity, container user, read-only attribute, or a di…

Two steps away (36)

publickeyGit

Git: Permission denied (publickey). fatal: Could not read from remote repository.

SSH authentication to GitHub/GitLab/Bitbucket failed — no key, wrong key, or the key isn’t added to your account.

EACCESnpm

npm ERR! code EACCES — permission denied

npm can’t write to a directory — usually global installs into a root-owned folder.

ENOSPCDocker

no space left on device (Docker / Linux)

The disk (or inode table) is full — Docker images, build cache, logs and volumes are common culprits.

403HTTP

HTTP 403 Forbidden

The server understood the request but refuses to authorize it — you (or the server process) are not allowed to access this resour…

0x80070002Windows

Windows Error 0x80070002: The system cannot find the file specified

A file or registry entry Windows expected is missing — common in Windows Update, backups and app installs.

0x80004005Windows

Windows Error 0x80004005 (E_FAIL): Unspecified error

A generic failure code — the operation failed for a reason the component didn’t report precisely. Context decides the fix.

SQLITE_BUSYSQL

sqlite3.OperationalError: database is locked (SQLITE_BUSY)

Another connection holds a write lock on the SQLite file, and this one gave up waiting.

SQLite no such columnSQL

sqlite3.OperationalError: no such column: x

SQLite can’t find the column — missing migration, typo, or a string written in double quotes.

SQLite UNIQUE failedSQL

sqlite3.IntegrityError: UNIQUE constraint failed: users.email

An insert/update duplicated a value in a UNIQUE or PRIMARY KEY column in SQLite.

sudoersLinux

user is not in the sudoers file. This incident will be reported.

Your account isn’t allowed to use sudo.

Not allowedWordPress

WordPress: Sorry, you are not allowed to access this page.

Your user role lacks the capability for that admin screen — or the database table prefix / user capabilities are out of sync afte…

EPERMNode.js

Error: EPERM: operation not permitted, rename / unlink

The OS refused a file operation — on Windows usually because another process (antivirus, editor, indexer) has the file locked.

2002MySQL

MySQL ERROR 2002 (HY000): Can't connect to local MySQL server through socket

The client couldn’t reach the MySQL server — it isn’t running, or the client is looking for the socket/port in the wrong place.

port is already allocatedDocker

Docker: Bind for 0.0.0.0:80 failed: port is already allocated

Another container or host process already publishes that host port.

ENOTFOUNDAPI

Error: getaddrinfo ENOTFOUND host / Name or service not known

DNS lookup for the hostname failed — the name is wrong, doesn’t exist, or this machine can’t resolve it.

ExpiredTokenAWS

AWS: ExpiredToken — The security token included in the request is expired

Temporary AWS credentials (STS/SSO/assumed role) have expired.

401HTTP

HTTP 401 Unauthorized

The request has no valid authentication credentials — you need to log in or send a valid token.

session_start()PHP

Warning: session_start(): Session cannot be started after headers have already been sent

session_start() ran after output was sent, so PHP can’t set the session cookie.

command not foundLinux

bash: command not found

The shell can’t find an executable with that name in any directory on your PATH.

Conflict container nameDocker

Conflict. The container name "/x" is already in use by container …

A container (running or stopped) already has that name; Docker won’t create a second one with the same name.

exec no such file or directoryDocker

exec /docker-entrypoint.sh: no such file or directory (CRLF line endings / missing interpreter)

The entrypoint file exists, but the kernel can’t run it — almost always Windows CRLF line endings in the script, or a shebang poi…

invalid_grantAuthentication

OAuth 2.0 Error: invalid_grant

The authorization code, refresh token or credentials sent to the token endpoint are invalid, expired, already used or were issued…

invalid_clientAuthentication

OAuth 2.0 Error: invalid_client

The OAuth server couldn’t authenticate your application — wrong client ID/secret, wrong auth method, or the client doesn’t exist…

clipboard write blockedJavaScript

NotAllowedError: Failed to execute 'writeText' on 'Clipboard': Document is not focused.

The Clipboard API refused to write — the page isn’t focused, there was no user gesture, or the context isn’t secure.

StringIndexOutOfBoundsExceptionJava

java.lang.StringIndexOutOfBoundsException: begin 0, end 10, length 5

substring()/charAt() used an index outside the string.

ArithmeticExceptionJava

java.lang.ArithmeticException: / by zero

Integer division or modulo by zero.

UnsupportedOperationExceptionJava

java.lang.UnsupportedOperationException (List.of / Arrays.asList is immutable)

Code tried to modify an immutable or fixed-size collection.

EADDRINUSENode.js

Error: listen EADDRINUSE: address already in use :::3000

Another process is already listening on that port.

Unhandled 'error' eventNode.js

Error: Unhandled 'error' event (events.js / node:events)

An EventEmitter (stream, socket, child process, server) emitted 'error' and nothing listened for it, so Node crashed.

spawn EACCESNode.js

Error: spawn EACCES

Node tried to execute a file that isn’t executable (missing +x permission) or isn’t a program.

CrashLoopBackOffKubernetes

Kubernetes: CrashLoopBackOff

The container starts, crashes (or exits), and Kubernetes keeps restarting it with increasing back-off delays.

ImagePullBackOffKubernetes

Kubernetes: ImagePullBackOff / ErrImagePull

The node can’t pull the container image — wrong name/tag, missing registry credentials, or registry unreachable.

EROFSnpm

npm ERR! code EROFS — EROFS: read-only file system

npm tried to write to a read-only location (read-only container filesystem, mounted volume, or system path).

ENOENTNode.js

Error: ENOENT: no such file or directory

A file or directory the program tried to open doesn’t exist at that path.

FileNotFoundExceptionJava

java.io.FileNotFoundException: config.properties (No such file or directory)

Java couldn’t open the file — wrong path relative to the working directory, missing file, or a classpath resource read as a file.

NoSuchFileExceptionJava

java.nio.file.NoSuchFileException: /path/file

An NIO Files operation targeted a path that doesn’t exist.