Error map

NoSuchFileException java.nio.file.NoSuchFileException: /path/file

Java · layer 4, Application & API

Open the full error page →

Centre: this error. First ring: errors it is linked with (12). Outer ring: what those are linked with. Colours show the layer of a request each error belongs to. Click any dot to re-centre the map on it; hover to follow its connections. The centre dot opens the error page.

NoSuchFileException — java.nio.file.NoSuchFileException: /path/file (Java)NoSuchFileE…ENOENT — Error: ENOENT: no such file or directory (Node.js)ENOENTAccess to the path is denied — System.UnauthorizedAccessException: Access to the path 'x' is denied (.NET)Access to the path …Filename too long — error: unable to create file x: Filename too long (Windows) (Git)Filename too longAccessDeniedException — java.nio.file.AccessDeniedException: /path (Java)AccessDeniedExcepti…EROFS — npm ERR! code EROFS — EROFS: read-only file system (npm)EROFSFileNotFoundError — FileNotFoundError: [Errno 2] No such file or directory: 'data.csv' (Python)FileNotFoundErrorUnicodeDecodeError — UnicodeDecodeError: 'utf-8' codec can't decode byte 0x92 in position 10: invalid start byte (Python)UnicodeDecodeError0x80070570 — Error 0x80070570: The file or directory is corrupted and unreadable (Windows)0x80070570FileNotFoundException — java.io.FileNotFoundException: config.properties (No such file or directory) (Java)FileNotFoundExcepti…EISDIR — Error: EISDIR: illegal operation on a directory, read (Node.js)EISDIRENOTDIR — Error: ENOTDIR: not a directory (Node.js)ENOTDIREEXIST — Error: EEXIST: file already exists, mkdir (Node.js)EEXISTMODULE_NOT_FOUND — Error: Cannot find module 'x' (MODULE_NOT_FOUND) (Node.js)MODULE_NOT_FOUNDcommand not found — bash: command not found (Linux)command not found0x80070002 — Windows Error 0x80070002: The system cannot find the file specified (Windows)0x80070002EACCES — npm ERR! code EACCES — permission denied (npm)EACCESdaemon — Cannot connect to the Docker daemon at unix:///var/run/docker.sock. Is the docker daemon running? (Docker)daemonEACCES — Linux: Permission denied (Linux)EACCESpathspec did not match — error: pathspec 'x' did not match any file(s) known to git (Git)pathspec did not ma…ENOENT — npm ERR! enoent ENOENT: no such file or directory, open '/path/package.json' (npm)ENOENTWSL 2 installation is incomplete — Docker Desktop: WSL 2 installation is incomplete / WSL update required (Docker)WSL 2 installation …403 — HTTP 403 Forbidden (HTTP)403invalid_scope — OAuth 2.0 Error: invalid_scope / insufficient_scope (Authentication)invalid_scope0x80070005 — Windows Error 0x80070005 (E_ACCESSDENIED): Access is denied (Windows)0x80070005port is already allocated — Docker: Bind for 0.0.0.0:80 failed: port is already allocated (Docker)port is already all…CrashLoopBackOff — Kubernetes: CrashLoopBackOff (Kubernetes)CrashLoopBackOffConflict container name — Conflict. The container name "/x" is already in use by container … (Docker)Conflict container …failed to open stream — Warning: include(x.php): Failed to open stream: No such file or directory (PHP)failed to open stre…PermissionError — PermissionError: [Errno 13] Permission denied: '/path' (Python)PermissionErrorunable to open database — sqlite3.OperationalError: unable to open database file (SQL)unable to open data…URIError — URIError: URI malformed (JavaScript)URIError22021 — ERROR: invalid byte sequence for encoding "UTF8": 0x00 (PostgreSQL)22021UnicodeEncodeError — UnicodeEncodeError: 'charmap' codec can't encode character '\u2192' (Python)UnicodeEncodeErrorMEMORY_MANAGEMENT — Blue Screen: MEMORY_MANAGEMENT (Stop code 0x0000001A) (Windows)MEMORY_MANAGEMENTENOTEMPTY — npm ERR! code ENOTEMPTY — ENOTEMPTY: directory not empty, rename (npm)ENOTEMPTYNo space left on device (inodes) — No space left on device, but df shows free space (inodes exhausted) (Linux)No space left on de…Argument list too long — bash: /bin/rm: Argument list too long (Linux)Argument list too l…wrong fs type, bad option, bad superblock — mount: wrong fs type, bad option, bad superblock on /dev/sdb1, missing codepage or helper program (Linux)wrong fs type, bad …0x80070020 — 0x80070020: The process cannot access the file because it is being used by another process (Windows)0x80070020EPERM — Error: EPERM: operation not permitted, rename / unlink (Node.js)EPERMEEXIST — npm ERR! code EEXIST — EEXIST: file already exists, symlink '../lib/node_modules/x/bin/x' -> '/usr/local/bin/x' (npm)EEXIST

Directly related (12)

ENOENTNode.js

Error: ENOENT: no such file or directory

A file or directory the program tried to open doesn’t exist at that path.

Access to the path is denied.NET

System.UnauthorizedAccessException: Access to the path 'x' is denied

The process’s identity can’t read/write that file or folder — IIS app pool identity, container user, read-only attribute, or a di…

Filename too longGit

error: unable to create file x: Filename too long (Windows)

Windows’ 260-character path limit blocked Git from creating a file.

AccessDeniedExceptionJava

java.nio.file.AccessDeniedException: /path

The OS denied a file operation to the Java process.

EROFSnpm

npm ERR! code EROFS — EROFS: read-only file system

npm tried to write to a read-only location (read-only container filesystem, mounted volume, or system path).

FileNotFoundErrorPython

FileNotFoundError: [Errno 2] No such file or directory: 'data.csv'

Python couldn’t find the file at that path — usually because relative paths resolve from the working directory, not the script.

UnicodeDecodeErrorPython

UnicodeDecodeError: 'utf-8' codec can't decode byte 0x92 in position 10: invalid start byte

Python read bytes that aren’t valid in the encoding it assumed (usually UTF-8).

0x80070570Windows

Error 0x80070570: The file or directory is corrupted and unreadable

Windows can’t read a file because the disk, USB stick or installation media has corrupted data or bad sectors.

FileNotFoundExceptionJava

java.io.FileNotFoundException: config.properties (No such file or directory)

Java couldn’t open the file — wrong path relative to the working directory, missing file, or a classpath resource read as a file.

EISDIRNode.js

Error: EISDIR: illegal operation on a directory, read

A file API (readFile, writeFile, createReadStream) was given a directory path.

ENOTDIRNode.js

Error: ENOTDIR: not a directory

A path treats a file as if it were a directory (e.g. file.txt/child).

EEXISTNode.js

Error: EEXIST: file already exists, mkdir

Node tried to create a file/directory/symlink that already exists.

Two steps away (29)

MODULE_NOT_FOUNDNode.js

Error: Cannot find module 'x' (MODULE_NOT_FOUND)

Node can’t resolve the module path — the package isn’t installed, or a relative path/extension is wrong.

command not foundLinux

bash: command not found

The shell can’t find an executable with that name in any directory on your PATH.

0x80070002Windows

Windows Error 0x80070002: The system cannot find the file specified

A file or registry entry Windows expected is missing — common in Windows Update, backups and app installs.

EACCESnpm

npm ERR! code EACCES — permission denied

npm can’t write to a directory — usually global installs into a root-owned folder.

daemonDocker

Cannot connect to the Docker daemon at unix:///var/run/docker.sock. Is the docker daemon running?

The docker CLI can’t talk to the Docker engine — it isn’t running, or your user can’t access the socket.

EACCESLinux

Linux: Permission denied

Your user (or the service user) lacks read/write/execute permission on a file, directory or one of its parents.

pathspec did not matchGit

error: pathspec 'x' did not match any file(s) known to git

Git couldn’t find the file or branch name you referenced.

ENOENTnpm

npm ERR! enoent ENOENT: no such file or directory, open '/path/package.json'

npm ran in a directory without a package.json.

WSL 2 installation is incompleteDocker

Docker Desktop: WSL 2 installation is incomplete / WSL update required

Docker Desktop on Windows needs WSL 2 and its Linux kernel; they’re missing, outdated or disabled.

403HTTP

HTTP 403 Forbidden

The server understood the request but refuses to authorize it — you (or the server process) are not allowed to access this resour…

invalid_scopeAuthentication

OAuth 2.0 Error: invalid_scope / insufficient_scope

The requested scope is unknown or not allowed for this client — or the token lacks the scope the API endpoint requires.

0x80070005Windows

Windows Error 0x80070005 (E_ACCESSDENIED): Access is denied

Windows refused an operation because the account or process lacks permission — seen in Windows Update, installers, Task Scheduler…

port is already allocatedDocker

Docker: Bind for 0.0.0.0:80 failed: port is already allocated

Another container or host process already publishes that host port.

CrashLoopBackOffKubernetes

Kubernetes: CrashLoopBackOff

The container starts, crashes (or exits), and Kubernetes keeps restarting it with increasing back-off delays.

Conflict container nameDocker

Conflict. The container name "/x" is already in use by container …

A container (running or stopped) already has that name; Docker won’t create a second one with the same name.

failed to open streamPHP

Warning: include(x.php): Failed to open stream: No such file or directory

PHP couldn’t open a file for include/require/fopen — wrong path, missing file, or no permission.

PermissionErrorPython

PermissionError: [Errno 13] Permission denied: '/path'

The OS refused the file operation — no permission, a directory passed to open(), or (on Windows) the file is open elsewhere.

unable to open databaseSQL

sqlite3.OperationalError: unable to open database file

SQLite couldn’t open or create the database file — wrong path or missing/unwritable directory.

URIErrorJavaScript

URIError: URI malformed

decodeURIComponent/decodeURI received an invalid percent-encoded sequence.

22021PostgreSQL

ERROR: invalid byte sequence for encoding "UTF8": 0x00

Text contained bytes invalid in UTF-8 — often a NUL byte (0x00) or Latin-1/Windows-1252 data.

UnicodeEncodeErrorPython

UnicodeEncodeError: 'charmap' codec can't encode character '\u2192'

Python tried to write text in an encoding that can’t represent some characters — common in Windows consoles and files opened with…

MEMORY_MANAGEMENTWindows

Blue Screen: MEMORY_MANAGEMENT (Stop code 0x0000001A)

Windows detected a severe memory-management error — commonly faulty RAM, unstable memory settings or a bad driver.

ENOTEMPTYnpm

npm ERR! code ENOTEMPTY — ENOTEMPTY: directory not empty, rename

npm couldn’t rename a folder in node_modules because it wasn’t empty — usually a corrupted or concurrently modified node_modules.

No space left on device (inodes)Linux

No space left on device, but df shows free space (inodes exhausted)

The filesystem has run out of inodes — the slots for files — even though there are gigabytes free, usually because of millions of…

Argument list too longLinux

bash: /bin/rm: Argument list too long

A glob like * expanded to more file names than the kernel allows in one command (ARG_MAX), so the command never ran.

wrong fs type, bad option, bad superblockLinux

mount: wrong fs type, bad option, bad superblock on /dev/sdb1, missing codepage or helper program

mount couldn’t mount the device — the filesystem type isn’t supported/installed, the partition is wrong, or the filesystem is dam…

0x80070020Windows

0x80070020: The process cannot access the file because it is being used by another process

Another program has the file open (locked), so Windows can’t modify, delete or replace it.

EPERMNode.js

Error: EPERM: operation not permitted, rename / unlink

The OS refused a file operation — on Windows usually because another process (antivirus, editor, indexer) has the file locked.

EEXISTnpm

npm ERR! code EEXIST — EEXIST: file already exists, symlink '../lib/node_modules/x/bin/x' -> '/usr/local/bin/x'

A global install can’t create its command link because a file with that name already exists.