Error map
FileNotFoundException java.io.FileNotFoundException: config.properties (No such file or directory)
Java · layer 4, Application & API
Centre: this error. First ring: errors it is linked with (12). Outer ring: what those are linked with. Colours show the layer of a request each error belongs to. Click any dot to re-centre the map on it; hover to follow its connections. The centre dot opens the error page.
Directly related (12)
Error: ENOENT: no such file or directory
A file or directory the program tried to open doesn’t exist at that path.
System.UnauthorizedAccessException: Access to the path 'x' is denied
The process’s identity can’t read/write that file or folder — IIS app pool identity, container user, read-only attribute, or a di…
error: unable to create file x: Filename too long (Windows)
Windows’ 260-character path limit blocked Git from creating a file.
java.nio.file.AccessDeniedException: /path
The OS denied a file operation to the Java process.
npm ERR! enoent ENOENT: no such file or directory, open '/path/package.json'
npm ran in a directory without a package.json.
npm ERR! code EROFS — EROFS: read-only file system
npm tried to write to a read-only location (read-only container filesystem, mounted volume, or system path).
FileNotFoundError: [Errno 2] No such file or directory: 'data.csv'
Python couldn’t find the file at that path — usually because relative paths resolve from the working directory, not the script.
UnicodeDecodeError: 'utf-8' codec can't decode byte 0x92 in position 10: invalid start byte
Python read bytes that aren’t valid in the encoding it assumed (usually UTF-8).
Error 0x80070570: The file or directory is corrupted and unreadable
Windows can’t read a file because the disk, USB stick or installation media has corrupted data or bad sectors.
java.nio.file.NoSuchFileException: /path/file
An NIO Files operation targeted a path that doesn’t exist.
Error: EISDIR: illegal operation on a directory, read
A file API (readFile, writeFile, createReadStream) was given a directory path.
Error: ENOTDIR: not a directory
A path treats a file as if it were a directory (e.g. file.txt/child).
Two steps away (31)
Error: Cannot find module 'x' (MODULE_NOT_FOUND)
Node can’t resolve the module path — the package isn’t installed, or a relative path/extension is wrong.
bash: command not found
The shell can’t find an executable with that name in any directory on your PATH.
Windows Error 0x80070002: The system cannot find the file specified
A file or registry entry Windows expected is missing — common in Windows Update, backups and app installs.
npm ERR! code EACCES — permission denied
npm can’t write to a directory — usually global installs into a root-owned folder.
Cannot connect to the Docker daemon at unix:///var/run/docker.sock. Is the docker daemon running?
The docker CLI can’t talk to the Docker engine — it isn’t running, or your user can’t access the socket.
Linux: Permission denied
Your user (or the service user) lacks read/write/execute permission on a file, directory or one of its parents.
error: pathspec 'x' did not match any file(s) known to git
Git couldn’t find the file or branch name you referenced.
Docker Desktop: WSL 2 installation is incomplete / WSL update required
Docker Desktop on Windows needs WSL 2 and its Linux kernel; they’re missing, outdated or disabled.
HTTP 403 Forbidden
The server understood the request but refuses to authorize it — you (or the server process) are not allowed to access this resour…
OAuth 2.0 Error: invalid_scope / insufficient_scope
The requested scope is unknown or not allowed for this client — or the token lacks the scope the API endpoint requires.
Windows Error 0x80070005 (E_ACCESSDENIED): Access is denied
Windows refused an operation because the account or process lacks permission — seen in Windows Update, installers, Task Scheduler…
fatal: not a git repository (or any of the parent directories): .git
You ran a Git command outside a Git working tree.
Author identity unknown *** Please tell me who you are.
Git doesn’t know your name and email for commits.
ERROR: JAVA_HOME is not set and no 'java' command could be found in your PATH.
Build tools (Gradle, Maven, Android tools) can’t find a JDK.
Docker: Bind for 0.0.0.0:80 failed: port is already allocated
Another container or host process already publishes that host port.
Kubernetes: CrashLoopBackOff
The container starts, crashes (or exits), and Kubernetes keeps restarting it with increasing back-off delays.
Conflict. The container name "/x" is already in use by container …
A container (running or stopped) already has that name; Docker won’t create a second one with the same name.
Warning: include(x.php): Failed to open stream: No such file or directory
PHP couldn’t open a file for include/require/fopen — wrong path, missing file, or no permission.
PermissionError: [Errno 13] Permission denied: '/path'
The OS refused the file operation — no permission, a directory passed to open(), or (on Windows) the file is open elsewhere.
sqlite3.OperationalError: unable to open database file
SQLite couldn’t open or create the database file — wrong path or missing/unwritable directory.
URIError: URI malformed
decodeURIComponent/decodeURI received an invalid percent-encoded sequence.
ERROR: invalid byte sequence for encoding "UTF8": 0x00
Text contained bytes invalid in UTF-8 — often a NUL byte (0x00) or Latin-1/Windows-1252 data.
UnicodeEncodeError: 'charmap' codec can't encode character '\u2192'
Python tried to write text in an encoding that can’t represent some characters — common in Windows consoles and files opened with…
Blue Screen: MEMORY_MANAGEMENT (Stop code 0x0000001A)
Windows detected a severe memory-management error — commonly faulty RAM, unstable memory settings or a bad driver.
Error: EEXIST: file already exists, mkdir
Node tried to create a file/directory/symlink that already exists.
npm ERR! code ENOTEMPTY — ENOTEMPTY: directory not empty, rename
npm couldn’t rename a folder in node_modules because it wasn’t empty — usually a corrupted or concurrently modified node_modules.
No space left on device, but df shows free space (inodes exhausted)
The filesystem has run out of inodes — the slots for files — even though there are gigabytes free, usually because of millions of…
bash: /bin/rm: Argument list too long
A glob like * expanded to more file names than the kernel allows in one command (ARG_MAX), so the command never ran.
mount: wrong fs type, bad option, bad superblock on /dev/sdb1, missing codepage or helper program
mount couldn’t mount the device — the filesystem type isn’t supported/installed, the partition is wrong, or the filesystem is dam…
Error: EPERM: operation not permitted, rename / unlink
The OS refused a file operation — on Windows usually because another process (antivirus, editor, indexer) has the file locked.
0x80070020: The process cannot access the file because it is being used by another process
Another program has the file open (locked), so Windows can’t modify, delete or replace it.
Map another error
Popular: 4035004000xC000007BTypeErrorCritical error404NullPointerException