Error map

0x80070570 Error 0x80070570: The file or directory is corrupted and unreadable

Windows · layer 6, Platform & cloud

Open the full error page →

Centre: this error. First ring: errors it is linked with (12). Outer ring: what those are linked with. Colours show the layer of a request each error belongs to. Click any dot to re-centre the map on it; hover to follow its connections. The centre dot opens the error page.

0x80070570 — Error 0x80070570: The file or directory is corrupted and unreadable (Windows)0x80070570ENOENT — Error: ENOENT: no such file or directory (Node.js)ENOENTunable to open database — sqlite3.OperationalError: unable to open database file (SQL)unable to open data…0x8007000D — Windows error 0x8007000D (The data is invalid) (Windows)0x8007000DAccess to the path is denied — System.UnauthorizedAccessException: Access to the path 'x' is denied (.NET)Access to the path …AccessDeniedException — java.nio.file.AccessDeniedException: /path (Java)AccessDeniedExcepti…EROFS — npm ERR! code EROFS — EROFS: read-only file system (npm)EROFSFileNotFoundError — FileNotFoundError: [Errno 2] No such file or directory: 'data.csv' (Python)FileNotFoundErrorUnicodeDecodeError — UnicodeDecodeError: 'utf-8' codec can't decode byte 0x92 in position 10: invalid start byte (Python)UnicodeDecodeErrorMEMORY_MANAGEMENT — Blue Screen: MEMORY_MANAGEMENT (Stop code 0x0000001A) (Windows)MEMORY_MANAGEMENTFileNotFoundException — java.io.FileNotFoundException: config.properties (No such file or directory) (Java)FileNotFoundExcepti…NoSuchFileException — java.nio.file.NoSuchFileException: /path/file (Java)NoSuchFileExceptionEISDIR — Error: EISDIR: illegal operation on a directory, read (Node.js)EISDIRMODULE_NOT_FOUND — Error: Cannot find module 'x' (MODULE_NOT_FOUND) (Node.js)MODULE_NOT_FOUNDcommand not found — bash: command not found (Linux)command not found0x80070002 — Windows Error 0x80070002: The system cannot find the file specified (Windows)0x80070002SQLITE_BUSY — sqlite3.OperationalError: database is locked (SQLITE_BUSY) (SQL)SQLITE_BUSYSQLite no such column — sqlite3.OperationalError: no such column: x (SQL)SQLite no such colu…SQLite FK failed — sqlite3.IntegrityError: FOREIGN KEY constraint failed (SQL)SQLite FK failed0x80070005 — Windows Error 0x80070005 (E_ACCESSDENIED): Access is denied (Windows)0x800700050x80070643 — Windows Error 0x80070643: Fatal error during installation (Windows)0x80070643Python not found — Python was not found; run without arguments to install from the Microsoft Store (Python)Python not foundEACCES — npm ERR! code EACCES — permission denied (npm)EACCESdaemon — Cannot connect to the Docker daemon at unix:///var/run/docker.sock. Is the docker daemon running? (Docker)daemonEACCES — Linux: Permission denied (Linux)EACCES403 — HTTP 403 Forbidden (HTTP)403invalid_scope — OAuth 2.0 Error: invalid_scope / insufficient_scope (Authentication)invalid_scopesudoers — user is not in the sudoers file. This incident will be reported. (Linux)sudoersport is already allocated — Docker: Bind for 0.0.0.0:80 failed: port is already allocated (Docker)port is already all…CrashLoopBackOff — Kubernetes: CrashLoopBackOff (Kubernetes)CrashLoopBackOffConflict container name — Conflict. The container name "/x" is already in use by container … (Docker)Conflict container …ENOTDIR — Error: ENOTDIR: not a directory (Node.js)ENOTDIRfailed to open stream — Warning: include(x.php): Failed to open stream: No such file or directory (PHP)failed to open stre…PermissionError — PermissionError: [Errno 13] Permission denied: '/path' (Python)PermissionErrorURIError — URIError: URI malformed (JavaScript)URIError22021 — ERROR: invalid byte sequence for encoding "UTF8": 0x00 (PostgreSQL)22021UnicodeEncodeError — UnicodeEncodeError: 'charmap' codec can't encode character '\u2192' (Python)UnicodeEncodeErrorOutOfMemoryError — java.lang.OutOfMemoryError: Java heap space (Java)OutOfMemoryErrorIRQL_NOT_LESS_OR_EQUAL — Blue Screen: IRQL_NOT_LESS_OR_EQUAL (Stop code 0x0000000A) (Windows)IRQL_NOT_LESS_OR_EQ…CRITICAL_PROCESS_DIED — Blue Screen: CRITICAL_PROCESS_DIED (Stop code 0x000000EF) (Windows)CRITICAL_PROCESS_DI…Filename too long — error: unable to create file x: Filename too long (Windows) (Git)Filename too longEEXIST — Error: EEXIST: file already exists, mkdir (Node.js)EEXISTENOENT — npm ERR! enoent ENOENT: no such file or directory, open '/path/package.json' (npm)ENOENTENOTEMPTY — npm ERR! code ENOTEMPTY — ENOTEMPTY: directory not empty, rename (npm)ENOTEMPTYNo space left on device (inodes) — No space left on device, but df shows free space (inodes exhausted) (Linux)No space left on de…Argument list too long — bash: /bin/rm: Argument list too long (Linux)Argument list too l…EPERM — Error: EPERM: operation not permitted, rename / unlink (Node.js)EPERMwrong fs type, bad option, bad superblock — mount: wrong fs type, bad option, bad superblock on /dev/sdb1, missing codepage or helper program (Linux)wrong fs type, bad …0x80070020 — 0x80070020: The process cannot access the file because it is being used by another process (Windows)0x80070020

Directly related (12)

ENOENTNode.js

Error: ENOENT: no such file or directory

A file or directory the program tried to open doesn’t exist at that path.

unable to open databaseSQL

sqlite3.OperationalError: unable to open database file

SQLite couldn’t open or create the database file — wrong path or missing/unwritable directory.

0x8007000DWindows

Windows error 0x8007000D (The data is invalid)

Windows read update, installer or setup data that is corrupted or incomplete.

Access to the path is denied.NET

System.UnauthorizedAccessException: Access to the path 'x' is denied

The process’s identity can’t read/write that file or folder — IIS app pool identity, container user, read-only attribute, or a di…

AccessDeniedExceptionJava

java.nio.file.AccessDeniedException: /path

The OS denied a file operation to the Java process.

EROFSnpm

npm ERR! code EROFS — EROFS: read-only file system

npm tried to write to a read-only location (read-only container filesystem, mounted volume, or system path).

FileNotFoundErrorPython

FileNotFoundError: [Errno 2] No such file or directory: 'data.csv'

Python couldn’t find the file at that path — usually because relative paths resolve from the working directory, not the script.

UnicodeDecodeErrorPython

UnicodeDecodeError: 'utf-8' codec can't decode byte 0x92 in position 10: invalid start byte

Python read bytes that aren’t valid in the encoding it assumed (usually UTF-8).

MEMORY_MANAGEMENTWindows

Blue Screen: MEMORY_MANAGEMENT (Stop code 0x0000001A)

Windows detected a severe memory-management error — commonly faulty RAM, unstable memory settings or a bad driver.

FileNotFoundExceptionJava

java.io.FileNotFoundException: config.properties (No such file or directory)

Java couldn’t open the file — wrong path relative to the working directory, missing file, or a classpath resource read as a file.

NoSuchFileExceptionJava

java.nio.file.NoSuchFileException: /path/file

An NIO Files operation targeted a path that doesn’t exist.

EISDIRNode.js

Error: EISDIR: illegal operation on a directory, read

A file API (readFile, writeFile, createReadStream) was given a directory path.

Two steps away (36)

MODULE_NOT_FOUNDNode.js

Error: Cannot find module 'x' (MODULE_NOT_FOUND)

Node can’t resolve the module path — the package isn’t installed, or a relative path/extension is wrong.

command not foundLinux

bash: command not found

The shell can’t find an executable with that name in any directory on your PATH.

0x80070002Windows

Windows Error 0x80070002: The system cannot find the file specified

A file or registry entry Windows expected is missing — common in Windows Update, backups and app installs.

SQLITE_BUSYSQL

sqlite3.OperationalError: database is locked (SQLITE_BUSY)

Another connection holds a write lock on the SQLite file, and this one gave up waiting.

SQLite no such columnSQL

sqlite3.OperationalError: no such column: x

SQLite can’t find the column — missing migration, typo, or a string written in double quotes.

SQLite FK failedSQL

sqlite3.IntegrityError: FOREIGN KEY constraint failed

An insert/update/delete violated a foreign key in SQLite (with PRAGMA foreign_keys=ON).

0x80070005Windows

Windows Error 0x80070005 (E_ACCESSDENIED): Access is denied

Windows refused an operation because the account or process lacks permission — seen in Windows Update, installers, Task Scheduler…

0x80070643Windows

Windows Error 0x80070643: Fatal error during installation

An MSI-based installer or update (often Defender definitions, .NET or the WinRE update KB5034441) failed during installation.

Python not foundPython

Python was not found; run without arguments to install from the Microsoft Store

Windows ran the Microsoft Store “App execution alias” instead of a real Python installation.

EACCESnpm

npm ERR! code EACCES — permission denied

npm can’t write to a directory — usually global installs into a root-owned folder.

daemonDocker

Cannot connect to the Docker daemon at unix:///var/run/docker.sock. Is the docker daemon running?

The docker CLI can’t talk to the Docker engine — it isn’t running, or your user can’t access the socket.

EACCESLinux

Linux: Permission denied

Your user (or the service user) lacks read/write/execute permission on a file, directory or one of its parents.

403HTTP

HTTP 403 Forbidden

The server understood the request but refuses to authorize it — you (or the server process) are not allowed to access this resour…

invalid_scopeAuthentication

OAuth 2.0 Error: invalid_scope / insufficient_scope

The requested scope is unknown or not allowed for this client — or the token lacks the scope the API endpoint requires.

sudoersLinux

user is not in the sudoers file. This incident will be reported.

Your account isn’t allowed to use sudo.

port is already allocatedDocker

Docker: Bind for 0.0.0.0:80 failed: port is already allocated

Another container or host process already publishes that host port.

CrashLoopBackOffKubernetes

Kubernetes: CrashLoopBackOff

The container starts, crashes (or exits), and Kubernetes keeps restarting it with increasing back-off delays.

Conflict container nameDocker

Conflict. The container name "/x" is already in use by container …

A container (running or stopped) already has that name; Docker won’t create a second one with the same name.

ENOTDIRNode.js

Error: ENOTDIR: not a directory

A path treats a file as if it were a directory (e.g. file.txt/child).

failed to open streamPHP

Warning: include(x.php): Failed to open stream: No such file or directory

PHP couldn’t open a file for include/require/fopen — wrong path, missing file, or no permission.

PermissionErrorPython

PermissionError: [Errno 13] Permission denied: '/path'

The OS refused the file operation — no permission, a directory passed to open(), or (on Windows) the file is open elsewhere.

URIErrorJavaScript

URIError: URI malformed

decodeURIComponent/decodeURI received an invalid percent-encoded sequence.

22021PostgreSQL

ERROR: invalid byte sequence for encoding "UTF8": 0x00

Text contained bytes invalid in UTF-8 — often a NUL byte (0x00) or Latin-1/Windows-1252 data.

UnicodeEncodeErrorPython

UnicodeEncodeError: 'charmap' codec can't encode character '\u2192'

Python tried to write text in an encoding that can’t represent some characters — common in Windows consoles and files opened with…

OutOfMemoryErrorJava

java.lang.OutOfMemoryError: Java heap space

The JVM ran out of heap memory and garbage collection couldn’t free enough.

IRQL_NOT_LESS_OR_EQUALWindows

Blue Screen: IRQL_NOT_LESS_OR_EQUAL (Stop code 0x0000000A)

A driver accessed memory at an interrupt level where that’s not allowed — almost always a faulty or incompatible driver, sometime…

CRITICAL_PROCESS_DIEDWindows

Blue Screen: CRITICAL_PROCESS_DIED (Stop code 0x000000EF)

A process Windows can’t run without (csrss, wininit, smss…) stopped unexpectedly, so the system halted.

Filename too longGit

error: unable to create file x: Filename too long (Windows)

Windows’ 260-character path limit blocked Git from creating a file.

EEXISTNode.js

Error: EEXIST: file already exists, mkdir

Node tried to create a file/directory/symlink that already exists.

ENOENTnpm

npm ERR! enoent ENOENT: no such file or directory, open '/path/package.json'

npm ran in a directory without a package.json.

ENOTEMPTYnpm

npm ERR! code ENOTEMPTY — ENOTEMPTY: directory not empty, rename

npm couldn’t rename a folder in node_modules because it wasn’t empty — usually a corrupted or concurrently modified node_modules.

No space left on device (inodes)Linux

No space left on device, but df shows free space (inodes exhausted)

The filesystem has run out of inodes — the slots for files — even though there are gigabytes free, usually because of millions of…

Argument list too longLinux

bash: /bin/rm: Argument list too long

A glob like * expanded to more file names than the kernel allows in one command (ARG_MAX), so the command never ran.

EPERMNode.js

Error: EPERM: operation not permitted, rename / unlink

The OS refused a file operation — on Windows usually because another process (antivirus, editor, indexer) has the file locked.

wrong fs type, bad option, bad superblockLinux

mount: wrong fs type, bad option, bad superblock on /dev/sdb1, missing codepage or helper program

mount couldn’t mount the device — the filesystem type isn’t supported/installed, the partition is wrong, or the filesystem is dam…

0x80070020Windows

0x80070020: The process cannot access the file because it is being used by another process

Another program has the file open (locked), so Windows can’t modify, delete or replace it.