Error map

gpg failed to sign error: gpg failed to sign the data — fatal: failed to write commit object

Git · layer 7, Build & delivery

Open the full error page →

Centre: this error. First ring: errors it is linked with (12). Outer ring: what those are linked with. Colours show the layer of a request each error belongs to. Click any dot to re-centre the map on it; hover to follow its connections. The centre dot opens the error page.

gpg failed to sign — error: gpg failed to sign the data — fatal: failed to write commit object (Git)gpg failed …SignatureDoesNotMatch — AWS: SignatureDoesNotMatch / InvalidClientTokenId — the request signature we calculated does not match (AWS)SignatureDoesNotMat…ImproperlyConfigured — django.core.exceptions.ImproperlyConfigured: settings are not configured / SECRET_KEY must not be empty (Python)ImproperlyConfiguredredirect_uri_mismatch — OAuth Error: redirect_uri_mismatch (Authentication)redirect_uri_mismat…1046 — MySQL ERROR 1046 (3D000): No database selected (MySQL)1046PHP mail — PHP mail() returns false / emails not delivered (PHP)PHP mailauthor identity unknown — Author identity unknown *** Please tell me who you are. (Git)author identity unk…ERR_INVALID_ARG_TYPE — TypeError [ERR_INVALID_ARG_TYPE]: The "path" argument must be of type string. Received undefined (Node.js)ERR_INVALID_ARG_TYPE1000 — Cloudflare Error 1000: DNS points to prohibited IP (Cloudflare)1000INSTALL_PARSE_FAILED_NO_CERTIFICATES — INSTALL_PARSE_FAILED_NO_CERTIFICATES / App not installed as package appears to be invalid (Android)INSTALL_PARSE_FAILE…ApiException: 10 — Google Sign-In: com.google.android.gms.common.api.ApiException: 10 (DEVELOPER_ERROR) (Android)ApiException: 10MongoParseError — MongoDB: MongoParseError: Invalid scheme, expected connection string to start with "mongodb://" or "mongodb+srv://" (MongoDB)MongoParseErrordivergent branches — hint: You have divergent branches and need to specify how to reconcile them. (Git)divergent branchesAccessDenied — AWS S3: AccessDenied (403) when calling GetObject / PutObject (AWS)AccessDeniedExpiredToken — AWS: ExpiredToken — The security token included in the request is expired (AWS)ExpiredTokenwebhook signature — Webhook signature verification failed (Stripe, Razorpay, GitHub…) (API)webhook signatureDjango no such table — django.db.utils.OperationalError: no such table: app_model (Python)Django no such tableDisallowedHost — django.core.exceptions.DisallowedHost: Invalid HTTP_HOST header: 'x'. You may need to add 'x' to ALLOWED_HOSTS. (Python)DisallowedHostTemplateDoesNotExist — django.template.exceptions.TemplateDoesNotExist: app/page.html (Python)TemplateDoesNotExistAADSTS700016 — Azure AD (Entra ID): AADSTS700016 Application not found in the directory (Azure)AADSTS700016400 — HTTP 400 Bad Request (HTTP)400invalid_grant — OAuth 2.0 Error: invalid_grant (Authentication)invalid_grantnot a constructor — TypeError: x is not a constructor (JavaScript)not a constructorTDZ — ReferenceError: Cannot access 'x' before initialization (JavaScript)TDZ1049 — MySQL ERROR 1049 (42000): Unknown database 'x' (MySQL)1049open_basedir — Warning: file_exists(): open_basedir restriction in effect. File(/x) is not within the allowed path(s) (PHP)open_basedirNo application encryption key — Laravel: No application encryption key has been specified. (PHP)No application encr…UPLOAD_ERR_INI_SIZE — PHP upload error 1: The uploaded file exceeds the upload_max_filesize directive in php.ini (PHP)UPLOAD_ERR_INI_SIZEnot a git repository — fatal: not a git repository (or any of the parent directories): .git (Git)not a git repository413 — HTTP 413 Content Too Large (Request Entity Too Large) (HTTP)413LF/CRLF warning — warning: in the working copy of 'x', LF will be replaced by CRLF the next time Git touches it (Git)LF/CRLF warningClassCastException — java.lang.ClassCastException: class A cannot be cast to class B (Java)ClassCastExceptionTS7016 — TS7016: Could not find a declaration file for module 'x'. 'x.js' implicitly has an 'any' type. (Node.js)TS7016TS2304 — TS2304: Cannot find name 'x'. (Node.js)TS2304DB connection — WordPress: Error Establishing a Database Connection (WordPress)DB connectionENOTFOUND — Error: getaddrinfo ENOTFOUND host / Name or service not known (API)ENOTFOUNDCould not resolve host — fatal: unable to access 'https://github.com/…': Could not resolve host: github.com (Git)Could not resolve h…INSTALL_FAILED_UPDATE_INCOMPATIBLE — Android: INSTALL_FAILED_UPDATE_INCOMPATIBLE (Android)INSTALL_FAILED_UPDA…INSTALL_FAILED_INSUFFICIENT_STORAGE — INSTALL_FAILED_INSUFFICIENT_STORAGE: Failure [INSTALL_FAILED_INSUFFICIENT_STORAGE] (Android)INSTALL_FAILED_INSU…INSTALL_FAILED_NO_MATCHING_ABIS — INSTALL_FAILED_NO_MATCHING_ABIS: Failed to extract native libraries (Android)INSTALL_FAILED_NO_M…invalid_client — OAuth 2.0 Error: invalid_client (Authentication)invalid_clientsigned in debug mode — Play Console: You uploaded an APK or Android App Bundle that was signed in debug mode. You need to sign your APK or Android App Bundle in release mode (Android)signed in debug modeDefault FirebaseApp is not initialized — IllegalStateException: Default FirebaseApp is not initialized in this process (Android)Default FirebaseApp…CreateContainerConfigError — Kubernetes: CreateContainerConfigError — secret / configmap not found (Kubernetes)CreateContainerConf…DataSource url not specified — Failed to configure a DataSource: 'url' attribute is not specified and no embedded datasource could be configured. (Java)DataSource url not …1153 — MySQL ERROR 1153 (08S01): Got a packet bigger than 'max_allowed_packet' bytes (MySQL)1153not possible to fast-forward — fatal: Not possible to fast-forward, aborting. (Git)not possible to fas…npm update check failed — npm update check failed — Try running with sudo or get access to the local update config store (npm)npm update check fa…max_input_vars — Warning: Unknown: Input variables exceeded 1000. To increase the limit change max_input_vars in php.ini. (PHP)max_input_vars

Directly related (12)

SignatureDoesNotMatchAWS

AWS: SignatureDoesNotMatch / InvalidClientTokenId — the request signature we calculated does not match

AWS rejected the request signature — wrong secret key, wrong region, clock skew, or a presigned URL used differently from how it…

ImproperlyConfiguredPython

django.core.exceptions.ImproperlyConfigured: settings are not configured / SECRET_KEY must not be empty

Django can’t load its settings — DJANGO_SETTINGS_MODULE unset, a required setting missing, or an environment variable not provide…

redirect_uri_mismatchAuthentication

OAuth Error: redirect_uri_mismatch

The redirect URI in your OAuth request doesn’t exactly match one registered for the client in the provider’s console.

1046MySQL

MySQL ERROR 1046 (3D000): No database selected

A query referenced tables without a database selected (no USE and no db in the connection).

PHP mailPHP

PHP mail() returns false / emails not delivered

PHP’s mail() function failed or emails never arrive (spam or rejected).

author identity unknownGit

Author identity unknown *** Please tell me who you are.

Git doesn’t know your name and email for commits.

ERR_INVALID_ARG_TYPENode.js

TypeError [ERR_INVALID_ARG_TYPE]: The "path" argument must be of type string. Received undefined

A Node API got an argument of the wrong type — usually undefined because an env var or config value is missing.

1000Cloudflare

Cloudflare Error 1000: DNS points to prohibited IP

A proxied DNS record points at a Cloudflare IP address, creating a loop.

INSTALL_PARSE_FAILED_NO_CERTIFICATESAndroid

INSTALL_PARSE_FAILED_NO_CERTIFICATES / App not installed as package appears to be invalid

The APK isn’t signed (or the signature is invalid for this Android version), so it can’t be installed.

ApiException: 10Android

Google Sign-In: com.google.android.gms.common.api.ApiException: 10 (DEVELOPER_ERROR)

Google Sign-In is misconfigured — the app’s package name or SHA-1/SHA-256 signing fingerprint isn’t registered in Google Cloud/Fi…

MongoParseErrorMongoDB

MongoDB: MongoParseError: Invalid scheme, expected connection string to start with "mongodb://" or "mongodb+srv://"

The connection string is missing, malformed, or the environment variable holding it is undefined.

divergent branchesGit

hint: You have divergent branches and need to specify how to reconcile them.

Git 2.27+ asks you to choose merge, rebase or fast-forward-only when local and remote both have new commits.

Two steps away (36)

AccessDeniedAWS

AWS S3: AccessDenied (403) when calling GetObject / PutObject

An IAM policy, bucket policy, ACL/ownership setting, Block Public Access or KMS key policy denied the S3 request.

ExpiredTokenAWS

AWS: ExpiredToken — The security token included in the request is expired

Temporary AWS credentials (STS/SSO/assumed role) have expired.

webhook signatureAPI

Webhook signature verification failed (Stripe, Razorpay, GitHub…)

Your endpoint computed a different HMAC signature than the one the provider sent, so the webhook is rejected.

Django no such tablePython

django.db.utils.OperationalError: no such table: app_model

Django queried a table that hasn’t been created — migrations missing or not applied.

DisallowedHostPython

django.core.exceptions.DisallowedHost: Invalid HTTP_HOST header: 'x'. You may need to add 'x' to ALLOWED_HOSTS.

The request’s Host header isn’t listed in Django’s ALLOWED_HOSTS.

TemplateDoesNotExistPython

django.template.exceptions.TemplateDoesNotExist: app/page.html

Django searched all template directories and couldn’t find that template.

AADSTS700016Azure

Azure AD (Entra ID): AADSTS700016 Application not found in the directory

The client ID in your sign-in request doesn’t exist in the tenant you’re authenticating against.

400HTTP

HTTP 400 Bad Request

The server could not understand the request because its syntax, headers or body are malformed or invalid.

invalid_grantAuthentication

OAuth 2.0 Error: invalid_grant

The authorization code, refresh token or credentials sent to the token endpoint are invalid, expired, already used or were issued…

not a constructorJavaScript

TypeError: x is not a constructor

new was used with something that isn’t a class/constructor — usually a wrong import.

TDZJavaScript

ReferenceError: Cannot access 'x' before initialization

A let/const/class was used before its declaration line ran (temporal dead zone) — often a circular import.

1049MySQL

MySQL ERROR 1049 (42000): Unknown database 'x'

The database named in the connection doesn’t exist on that server.

open_basedirPHP

Warning: file_exists(): open_basedir restriction in effect. File(/x) is not within the allowed path(s)

PHP is configured to access only certain directories, and the script tried to touch a file outside them.

No application encryption keyPHP

Laravel: No application encryption key has been specified.

Laravel’s APP_KEY is missing, so it can’t encrypt sessions and cookies.

UPLOAD_ERR_INI_SIZEPHP

PHP upload error 1: The uploaded file exceeds the upload_max_filesize directive in php.ini

The uploaded file is bigger than PHP’s upload_max_filesize, so PHP discarded it.

not a git repositoryGit

fatal: not a git repository (or any of the parent directories): .git

You ran a Git command outside a Git working tree.

413HTTP

HTTP 413 Content Too Large (Request Entity Too Large)

The request body is bigger than the server is willing to accept — usually a file upload over the configured limit.

LF/CRLF warningGit

warning: in the working copy of 'x', LF will be replaced by CRLF the next time Git touches it

Git’s line-ending conversion (core.autocrlf) will change line endings in your working copy.

ClassCastExceptionJava

java.lang.ClassCastException: class A cannot be cast to class B

An object was cast to a type it isn’t.

TS7016Node.js

TS7016: Could not find a declaration file for module 'x'. 'x.js' implicitly has an 'any' type.

The JavaScript package has no TypeScript types bundled and no @types package installed.

TS2304Node.js

TS2304: Cannot find name 'x'.

TypeScript doesn’t know an identifier — a missing import, missing type definitions (e.g. for Node or Jest globals), or a typo.

DB connectionWordPress

WordPress: Error Establishing a Database Connection

WordPress can’t connect to its MySQL/MariaDB database with the credentials in wp-config.php, or the database server is down.

ENOTFOUNDAPI

Error: getaddrinfo ENOTFOUND host / Name or service not known

DNS lookup for the hostname failed — the name is wrong, doesn’t exist, or this machine can’t resolve it.

Could not resolve hostGit

fatal: unable to access 'https://github.com/…': Could not resolve host: github.com

DNS lookup for the Git host failed from this machine.

INSTALL_FAILED_UPDATE_INCOMPATIBLEAndroid

Android: INSTALL_FAILED_UPDATE_INCOMPATIBLE

An app with the same package name but a different signing key is already installed on the device.

INSTALL_FAILED_INSUFFICIENT_STORAGEAndroid

INSTALL_FAILED_INSUFFICIENT_STORAGE: Failure [INSTALL_FAILED_INSUFFICIENT_STORAGE]

The device or emulator doesn’t have enough free internal storage to install the APK.

INSTALL_FAILED_NO_MATCHING_ABISAndroid

INSTALL_FAILED_NO_MATCHING_ABIS: Failed to extract native libraries

The APK contains native (.so) libraries only for CPU architectures the device doesn’t support — e.g. x86 emulator with arm-only l…

invalid_clientAuthentication

OAuth 2.0 Error: invalid_client

The OAuth server couldn’t authenticate your application — wrong client ID/secret, wrong auth method, or the client doesn’t exist…

signed in debug modeAndroid

Play Console: You uploaded an APK or Android App Bundle that was signed in debug mode. You need to sign your APK or Android App Bundle in release mode

The bundle was signed with the debug keystore; Play only accepts release-signed uploads.

Default FirebaseApp is not initializedAndroid

IllegalStateException: Default FirebaseApp is not initialized in this process

Firebase couldn’t initialise because google-services.json or the Google Services Gradle plugin is missing/misapplied, or initiali…

CreateContainerConfigErrorKubernetes

Kubernetes: CreateContainerConfigError — secret / configmap not found

Kubernetes can’t build the container’s configuration — usually a referenced Secret, ConfigMap or key doesn’t exist in that namesp…

DataSource url not specifiedJava

Failed to configure a DataSource: 'url' attribute is not specified and no embedded datasource could be configured.

Spring Boot found JDBC/JPA on the classpath but no database URL.

1153MySQL

MySQL ERROR 1153 (08S01): Got a packet bigger than 'max_allowed_packet' bytes

A single statement or row exceeded max_allowed_packet — big BLOBs, huge INSERTs or large dump lines.

not possible to fast-forwardGit

fatal: Not possible to fast-forward, aborting.

pull is configured to fast-forward only, but your branch and the remote have diverged.

npm update check failednpm

npm update check failed — Try running with sudo or get access to the local update config store

npm’s update notifier couldn’t write its config — usually root-owned files in ~/.config from a past sudo npm.

max_input_varsPHP

Warning: Unknown: Input variables exceeded 1000. To increase the limit change max_input_vars in php.ini.

The form submitted more fields than PHP’s max_input_vars allows; extra fields were silently dropped.