Error map

DataSource url not specified Failed to configure a DataSource: 'url' attribute is not specified and no embedded datasource could be configured.

Java · layer 4, Application & API

Open the full error page →

Centre: this error. First ring: errors it is linked with (12). Outer ring: what those are linked with. Colours show the layer of a request each error belongs to. Click any dot to re-centre the map on it; hover to follow its connections. The centre dot opens the error page.

DataSource url not specified — Failed to configure a DataSource: 'url' attribute is not specified and no embedded datasource could be configured. (Java)DataSource …secretOrPrivateKey must have a value — Error: secretOrPrivateKey must have a value (jsonwebtoken sign) (Authentication)secretOrPrivateKey …redirect_uri_mismatch — OAuth Error: redirect_uri_mismatch (Authentication)redirect_uri_mismat…MethodArgumentNotValidException — MethodArgumentNotValidException: Validation failed for argument [0] (Java)MethodArgumentNotVa…1000 — Cloudflare Error 1000: DNS points to prohibited IP (Cloudflare)1000MongoParseError — MongoDB: MongoParseError: Invalid scheme, expected connection string to start with "mongodb://" or "mongodb+srv://" (MongoDB)MongoParseErrordivergent branches — hint: You have divergent branches and need to specify how to reconcile them. (Git)divergent branchesLF/CRLF warning — warning: in the working copy of 'x', LF will be replaced by CRLF the next time Git touches it (Git)LF/CRLF warningUnsatisfiedDependencyException — UnsatisfiedDependencyException / NoSuchBeanDefinitionException: No qualifying bean of type 'X' available (Java)UnsatisfiedDependen…HttpMessageNotReadableException — HttpMessageNotReadableException: JSON parse error / Required request body is missing (Java)HttpMessageNotReada…feature_not_enabled — API Error: Feature not enabled for this account (feature_not_enabled / not available on your plan) (API)feature_not_enabledYou must specify a region — You must specify a region. You can also configure your region by running "aws configure" (NoRegionError) (AWS)You must specify a …ConnectionString property has not been initialized — InvalidOperationException: The ConnectionString property has not been initialized (.NET)ConnectionString pr…413 — HTTP 413 Content Too Large (Request Entity Too Large) (HTTP)413TokenExpiredError — JWT Expired / Invalid Token (Authentication)TokenExpiredErrorCreateContainerConfigError — Kubernetes: CreateContainerConfigError — secret / configmap not found (Kubernetes)CreateContainerConf…AADSTS700016 — Azure AD (Entra ID): AADSTS700016 Application not found in the directory (Azure)AADSTS700016400 — HTTP 400 Bad Request (HTTP)400invalid_grant — OAuth 2.0 Error: invalid_grant (Authentication)invalid_grant422 — HTTP 422 Unprocessable Content (HTTP)422NumberFormatException — java.lang.NumberFormatException: For input string: "x" (Java)NumberFormatExcepti…IllegalArgumentException — java.lang.IllegalArgumentException (Java)IllegalArgumentExce…DB connection — WordPress: Error Establishing a Database Connection (WordPress)DB connectionENOTFOUND — Error: getaddrinfo ENOTFOUND host / Name or service not known (API)ENOTFOUNDCould not resolve host — fatal: unable to access 'https://github.com/…': Could not resolve host: github.com (Git)Could not resolve h…author identity unknown — Author identity unknown *** Please tell me who you are. (Git)author identity unk…gpg failed to sign — error: gpg failed to sign the data — fatal: failed to write commit object (Git)gpg failed to sign1046 — MySQL ERROR 1046 (3D000): No database selected (MySQL)1046not possible to fast-forward — fatal: Not possible to fast-forward, aborting. (Git)not possible to fas…1153 — MySQL ERROR 1153 (08S01): Got a packet bigger than 'max_allowed_packet' bytes (MySQL)1153ERR_INVALID_ARG_TYPE — TypeError [ERR_INVALID_ARG_TYPE]: The "path" argument must be of type string. Received undefined (Node.js)ERR_INVALID_ARG_TYPEnpm update check failed — npm update check failed — Try running with sudo or get access to the local update config store (npm)npm update check fa…out of shared memory — ERROR: out of shared memory — HINT: You might need to increase max_locks_per_transaction. (PostgreSQL)out of shared memoryapi_version_invalid — API Error: Invalid or unsupported API version (API)api_version_invalidInvalidOperationException — InvalidOperationException: Unable to resolve service for type 'X' while attempting to activate 'Y' (.NET)InvalidOperationExc…circular references — The dependencies of some of the beans in the application context form a cycle (Java)circular referencesPort 8080 in use — Web server failed to start. Port 8080 was already in use. (Java)Port 8080 in useMismatchedInputException — com.fasterxml.jackson.databind.exc.MismatchedInputException: Cannot deserialize value of type `java.util.ArrayList` from Object value (Java)MismatchedInputExce…UnrecognizedPropertyException — com.fasterxml.jackson.databind.exc.UnrecognizedPropertyException: Unrecognized field "x", not marked as ignorable (Java)UnrecognizedPropert…InvalidDefinitionException — com.fasterxml.jackson.databind.exc.InvalidDefinitionException: No serializer found for class X and no properties discovered (Java)InvalidDefinitionEx…403 — HTTP 403 Forbidden (HTTP)4031049 — MySQL ERROR 1049 (42000): Unknown database 'x' (MySQL)1049open_basedir — Warning: file_exists(): open_basedir restriction in effect. File(/x) is not within the allowed path(s) (PHP)open_basedirNoCredentialsError — AWS: Unable to locate credentials / Could not load credentials from any providers (AWS)NoCredentialsErrorNo application encryption key — Laravel: No application encryption key has been specified. (PHP)No application encr…PHP mail — PHP mail() returns false / emails not delivered (PHP)PHP mailUPLOAD_ERR_INI_SIZE — PHP upload error 1: The uploaded file exceeds the upload_max_filesize directive in php.ini (PHP)UPLOAD_ERR_INI_SIZEmax_input_vars — Warning: Unknown: Input variables exceeded 1000. To increase the limit change max_input_vars in php.ini. (PHP)max_input_vars3D000 — FATAL: database "x" does not exist (PostgreSQL)3D000

Directly related (12)

secretOrPrivateKey must have a valueAuthentication

Error: secretOrPrivateKey must have a value (jsonwebtoken sign)

jwt.sign() got an empty secret — the environment variable holding the JWT secret isn’t loaded.

redirect_uri_mismatchAuthentication

OAuth Error: redirect_uri_mismatch

The redirect URI in your OAuth request doesn’t exactly match one registered for the client in the provider’s console.

MethodArgumentNotValidExceptionJava

MethodArgumentNotValidException: Validation failed for argument [0]

Bean Validation (@Valid with @NotNull, @Email, @Size…) rejected the request body.

1000Cloudflare

Cloudflare Error 1000: DNS points to prohibited IP

A proxied DNS record points at a Cloudflare IP address, creating a loop.

MongoParseErrorMongoDB

MongoDB: MongoParseError: Invalid scheme, expected connection string to start with "mongodb://" or "mongodb+srv://"

The connection string is missing, malformed, or the environment variable holding it is undefined.

divergent branchesGit

hint: You have divergent branches and need to specify how to reconcile them.

Git 2.27+ asks you to choose merge, rebase or fast-forward-only when local and remote both have new commits.

LF/CRLF warningGit

warning: in the working copy of 'x', LF will be replaced by CRLF the next time Git touches it

Git’s line-ending conversion (core.autocrlf) will change line endings in your working copy.

UnsatisfiedDependencyExceptionJava

UnsatisfiedDependencyException / NoSuchBeanDefinitionException: No qualifying bean of type 'X' available

Spring couldn’t find (or choose) a bean to inject.

HttpMessageNotReadableExceptionJava

HttpMessageNotReadableException: JSON parse error / Required request body is missing

Spring couldn’t read the request body into your @RequestBody object.

feature_not_enabledAPI

API Error: Feature not enabled for this account (feature_not_enabled / not available on your plan)

The endpoint or option exists, but your account, plan, region or project hasn’t been granted access to it.

You must specify a regionAWS

You must specify a region. You can also configure your region by running "aws configure" (NoRegionError)

No region is configured for the CLI/SDK call.

ConnectionString property has not been initialized.NET

InvalidOperationException: The ConnectionString property has not been initialized

The database connection was opened with an empty connection string — the configuration key wasn’t found.

Two steps away (36)

413HTTP

HTTP 413 Content Too Large (Request Entity Too Large)

The request body is bigger than the server is willing to accept — usually a file upload over the configured limit.

TokenExpiredErrorAuthentication

JWT Expired / Invalid Token

The JSON Web Token sent with the request is expired, malformed or signed with a different key, so the API rejects it (usually wit…

CreateContainerConfigErrorKubernetes

Kubernetes: CreateContainerConfigError — secret / configmap not found

Kubernetes can’t build the container’s configuration — usually a referenced Secret, ConfigMap or key doesn’t exist in that namesp…

AADSTS700016Azure

Azure AD (Entra ID): AADSTS700016 Application not found in the directory

The client ID in your sign-in request doesn’t exist in the tenant you’re authenticating against.

400HTTP

HTTP 400 Bad Request

The server could not understand the request because its syntax, headers or body are malformed or invalid.

invalid_grantAuthentication

OAuth 2.0 Error: invalid_grant

The authorization code, refresh token or credentials sent to the token endpoint are invalid, expired, already used or were issued…

422HTTP

HTTP 422 Unprocessable Content

The request is well-formed, but the data fails validation (e.g. invalid email, missing required field).

NumberFormatExceptionJava

java.lang.NumberFormatException: For input string: "x"

A string couldn’t be parsed as a number — it’s empty, has spaces/commas, is too large, or isn’t numeric.

IllegalArgumentExceptionJava

java.lang.IllegalArgumentException

A method rejected an argument value as invalid.

DB connectionWordPress

WordPress: Error Establishing a Database Connection

WordPress can’t connect to its MySQL/MariaDB database with the credentials in wp-config.php, or the database server is down.

ENOTFOUNDAPI

Error: getaddrinfo ENOTFOUND host / Name or service not known

DNS lookup for the hostname failed — the name is wrong, doesn’t exist, or this machine can’t resolve it.

Could not resolve hostGit

fatal: unable to access 'https://github.com/…': Could not resolve host: github.com

DNS lookup for the Git host failed from this machine.

author identity unknownGit

Author identity unknown *** Please tell me who you are.

Git doesn’t know your name and email for commits.

gpg failed to signGit

error: gpg failed to sign the data — fatal: failed to write commit object

Commit signing is enabled but GPG couldn’t sign — no TTY for the passphrase, wrong key, or agent not running.

1046MySQL

MySQL ERROR 1046 (3D000): No database selected

A query referenced tables without a database selected (no USE and no db in the connection).

not possible to fast-forwardGit

fatal: Not possible to fast-forward, aborting.

pull is configured to fast-forward only, but your branch and the remote have diverged.

1153MySQL

MySQL ERROR 1153 (08S01): Got a packet bigger than 'max_allowed_packet' bytes

A single statement or row exceeded max_allowed_packet — big BLOBs, huge INSERTs or large dump lines.

ERR_INVALID_ARG_TYPENode.js

TypeError [ERR_INVALID_ARG_TYPE]: The "path" argument must be of type string. Received undefined

A Node API got an argument of the wrong type — usually undefined because an env var or config value is missing.

npm update check failednpm

npm update check failed — Try running with sudo or get access to the local update config store

npm’s update notifier couldn’t write its config — usually root-owned files in ~/.config from a past sudo npm.

out of shared memoryPostgreSQL

ERROR: out of shared memory — HINT: You might need to increase max_locks_per_transaction.

A transaction took more locks than the lock table can hold — usually touching many tables/partitions at once.

api_version_invalidAPI

API Error: Invalid or unsupported API version

The API version you requested — in the URL, a header or the SDK config — doesn’t exist or has been retired.

InvalidOperationException.NET

InvalidOperationException: Unable to resolve service for type 'X' while attempting to activate 'Y'

ASP.NET Core’s dependency injection container can’t build Y because one of its constructor dependencies (X) was never registered.

circular referencesJava

The dependencies of some of the beans in the application context form a cycle

Two or more Spring beans depend on each other through constructors, and Spring Boot 2.6+ forbids cycles by default.

Port 8080 in useJava

Web server failed to start. Port 8080 was already in use.

Spring Boot couldn’t bind its embedded server port because another process uses it.

MismatchedInputExceptionJava

com.fasterxml.jackson.databind.exc.MismatchedInputException: Cannot deserialize value of type `java.util.ArrayList` from Object value

Jackson found JSON whose shape doesn’t match the target Java type (object vs array, string vs number, missing constructor).

UnrecognizedPropertyExceptionJava

com.fasterxml.jackson.databind.exc.UnrecognizedPropertyException: Unrecognized field "x", not marked as ignorable

The JSON contains a field your Java class doesn’t have, and Jackson is configured to fail on unknown properties.

InvalidDefinitionExceptionJava

com.fasterxml.jackson.databind.exc.InvalidDefinitionException: No serializer found for class X and no properties discovered

Jackson can’t serialize the class — it has no public getters/fields, or it’s a Hibernate proxy, or Java 8 date types without the…

403HTTP

HTTP 403 Forbidden

The server understood the request but refuses to authorize it — you (or the server process) are not allowed to access this resour…

1049MySQL

MySQL ERROR 1049 (42000): Unknown database 'x'

The database named in the connection doesn’t exist on that server.

open_basedirPHP

Warning: file_exists(): open_basedir restriction in effect. File(/x) is not within the allowed path(s)

PHP is configured to access only certain directories, and the script tried to touch a file outside them.

NoCredentialsErrorAWS

AWS: Unable to locate credentials / Could not load credentials from any providers

The AWS CLI/SDK found no credentials in any place it looks — env vars, profile files, SSO cache or an instance/task role.

No application encryption keyPHP

Laravel: No application encryption key has been specified.

Laravel’s APP_KEY is missing, so it can’t encrypt sessions and cookies.

PHP mailPHP

PHP mail() returns false / emails not delivered

PHP’s mail() function failed or emails never arrive (spam or rejected).

UPLOAD_ERR_INI_SIZEPHP

PHP upload error 1: The uploaded file exceeds the upload_max_filesize directive in php.ini

The uploaded file is bigger than PHP’s upload_max_filesize, so PHP discarded it.

max_input_varsPHP

Warning: Unknown: Input variables exceeded 1000. To increase the limit change max_input_vars in php.ini.

The form submitted more fields than PHP’s max_input_vars allows; extra fields were silently dropped.

3D000PostgreSQL

FATAL: database "x" does not exist

The connection names a database that isn’t on that server.