Error map

max_input_vars Warning: Unknown: Input variables exceeded 1000. To increase the limit change max_input_vars in php.ini.

PHP · layer 4, Application & API

Open the full error page →

Centre: this error. First ring: errors it is linked with (12). Outer ring: what those are linked with. Colours show the layer of a request each error belongs to. Click any dot to re-centre the map on it; hover to follow its connections. The centre dot opens the error page.

max_input_vars — Warning: Unknown: Input variables exceeded 1000. To increase the limit change max_input_vars in php.ini. (PHP)max_input_v…gpg failed to sign — error: gpg failed to sign the data — fatal: failed to write commit object (Git)gpg failed to signsecretOrPrivateKey must have a value — Error: secretOrPrivateKey must have a value (jsonwebtoken sign) (Authentication)secretOrPrivateKey …redirect_uri_mismatch — OAuth Error: redirect_uri_mismatch (Authentication)redirect_uri_mismat…PHP mail — PHP mail() returns false / emails not delivered (PHP)PHP mail1000 — Cloudflare Error 1000: DNS points to prohibited IP (Cloudflare)1000MongoParseError — MongoDB: MongoParseError: Invalid scheme, expected connection string to start with "mongodb://" or "mongodb+srv://" (MongoDB)MongoParseErrordivergent branches — hint: You have divergent branches and need to specify how to reconcile them. (Git)divergent branchesNo application encryption key — Laravel: No application encryption key has been specified. (PHP)No application encr…feature_not_enabled — API Error: Feature not enabled for this account (feature_not_enabled / not available on your plan) (API)feature_not_enabledYou must specify a region — You must specify a region. You can also configure your region by running "aws configure" (NoRegionError) (AWS)You must specify a …ConnectionString property has not been initialized — InvalidOperationException: The ConnectionString property has not been initialized (.NET)ConnectionString pr…Link expired — WordPress: The link you followed has expired (WordPress)Link expiredINSTALL_FAILED_UPDATE_INCOMPATIBLE — Android: INSTALL_FAILED_UPDATE_INCOMPATIBLE (Android)INSTALL_FAILED_UPDA…413 — HTTP 413 Content Too Large (Request Entity Too Large) (HTTP)413CreateContainerConfigError — Kubernetes: CreateContainerConfigError — secret / configmap not found (Kubernetes)CreateContainerConf…TokenExpiredError — JWT Expired / Invalid Token (Authentication)TokenExpiredErrorLF/CRLF warning — warning: in the working copy of 'x', LF will be replaced by CRLF the next time Git touches it (Git)LF/CRLF warningDataSource url not specified — Failed to configure a DataSource: 'url' attribute is not specified and no embedded datasource could be configured. (Java)DataSource url not …AADSTS700016 — Azure AD (Entra ID): AADSTS700016 Application not found in the directory (Azure)AADSTS700016400 — HTTP 400 Bad Request (HTTP)400invalid_grant — OAuth 2.0 Error: invalid_grant (Authentication)invalid_grantopen_basedir — Warning: file_exists(): open_basedir restriction in effect. File(/x) is not within the allowed path(s) (PHP)open_basedirUPLOAD_ERR_INI_SIZE — PHP upload error 1: The uploaded file exceeds the upload_max_filesize directive in php.ini (PHP)UPLOAD_ERR_INI_SIZEapi_version_invalid — API Error: Invalid or unsupported API version (API)api_version_invalidDB connection — WordPress: Error Establishing a Database Connection (WordPress)DB connectionENOTFOUND — Error: getaddrinfo ENOTFOUND host / Name or service not known (API)ENOTFOUNDCould not resolve host — fatal: unable to access 'https://github.com/…': Could not resolve host: github.com (Git)Could not resolve h…author identity unknown — Author identity unknown *** Please tell me who you are. (Git)author identity unk…1046 — MySQL ERROR 1046 (3D000): No database selected (MySQL)10461049 — MySQL ERROR 1049 (42000): Unknown database 'x' (MySQL)1049not possible to fast-forward — fatal: Not possible to fast-forward, aborting. (Git)not possible to fas…1153 — MySQL ERROR 1153 (08S01): Got a packet bigger than 'max_allowed_packet' bytes (MySQL)1153ERR_INVALID_ARG_TYPE — TypeError [ERR_INVALID_ARG_TYPE]: The "path" argument must be of type string. Received undefined (Node.js)ERR_INVALID_ARG_TYPE419 Page Expired — Laravel: 419 Page Expired (CSRF token mismatch) (PHP)419 Page ExpiredTarget class does not exist — Laravel: Target class [App\Http\Controllers\X] does not exist. (PHP)Target class does n…Laravel table not found — Laravel: SQLSTATE[42S02]: Base table or view not found: 1146 Table 'db.sessions' doesn't exist (PHP)Laravel table not f…403 — HTTP 403 Forbidden (HTTP)403npm update check failed — npm update check failed — Try running with sudo or get access to the local update config store (npm)npm update check fa…3D000 — FATAL: database "x" does not exist (PostgreSQL)3D000NoCredentialsError — AWS: Unable to locate credentials / Could not load credentials from any providers (AWS)NoCredentialsErrorout of shared memory — ERROR: out of shared memory — HINT: You might need to increase max_locks_per_transaction. (PostgreSQL)out of shared memoryImproperlyConfigured — django.core.exceptions.ImproperlyConfigured: settings are not configured / SECRET_KEY must not be empty (Python)ImproperlyConfiguredDisallowedHost — django.core.exceptions.DisallowedHost: Invalid HTTP_HOST header: 'x'. You may need to add 'x' to ALLOWED_HOSTS. (Python)DisallowedHostReact must be in scope — ReferenceError: React is not defined / 'React' must be in scope when using JSX (React)React must be in sc…Network-related error — SQL Server: A network-related or instance-specific error occurred while establishing a connection to SQL Server. (provider: Named Pipes Provider, error: 40 / TCP Provider, error: 26) (SQL)Network-related err…Maximum execution time — PHP Fatal error: Maximum execution time of 30 seconds exceeded (PHP)Maximum execution t…Critical error — WordPress: There Has Been a Critical Error on This Website (WordPress)Critical errorfile_type_not_allowed — Upload error: File type not allowed / unsupported file type (API)file_type_not_allow…

Directly related (12)

gpg failed to signGit

error: gpg failed to sign the data — fatal: failed to write commit object

Commit signing is enabled but GPG couldn’t sign — no TTY for the passphrase, wrong key, or agent not running.

secretOrPrivateKey must have a valueAuthentication

Error: secretOrPrivateKey must have a value (jsonwebtoken sign)

jwt.sign() got an empty secret — the environment variable holding the JWT secret isn’t loaded.

redirect_uri_mismatchAuthentication

OAuth Error: redirect_uri_mismatch

The redirect URI in your OAuth request doesn’t exactly match one registered for the client in the provider’s console.

PHP mailPHP

PHP mail() returns false / emails not delivered

PHP’s mail() function failed or emails never arrive (spam or rejected).

1000Cloudflare

Cloudflare Error 1000: DNS points to prohibited IP

A proxied DNS record points at a Cloudflare IP address, creating a loop.

MongoParseErrorMongoDB

MongoDB: MongoParseError: Invalid scheme, expected connection string to start with "mongodb://" or "mongodb+srv://"

The connection string is missing, malformed, or the environment variable holding it is undefined.

divergent branchesGit

hint: You have divergent branches and need to specify how to reconcile them.

Git 2.27+ asks you to choose merge, rebase or fast-forward-only when local and remote both have new commits.

No application encryption keyPHP

Laravel: No application encryption key has been specified.

Laravel’s APP_KEY is missing, so it can’t encrypt sessions and cookies.

feature_not_enabledAPI

API Error: Feature not enabled for this account (feature_not_enabled / not available on your plan)

The endpoint or option exists, but your account, plan, region or project hasn’t been granted access to it.

You must specify a regionAWS

You must specify a region. You can also configure your region by running "aws configure" (NoRegionError)

No region is configured for the CLI/SDK call.

ConnectionString property has not been initialized.NET

InvalidOperationException: The ConnectionString property has not been initialized

The database connection was opened with an empty connection string — the configuration key wasn’t found.

Link expiredWordPress

WordPress: The link you followed has expired

Usually an upload (theme, plugin, media) larger than PHP’s upload/post limits — WordPress receives an empty request and shows thi…

Two steps away (36)

INSTALL_FAILED_UPDATE_INCOMPATIBLEAndroid

Android: INSTALL_FAILED_UPDATE_INCOMPATIBLE

An app with the same package name but a different signing key is already installed on the device.

413HTTP

HTTP 413 Content Too Large (Request Entity Too Large)

The request body is bigger than the server is willing to accept — usually a file upload over the configured limit.

CreateContainerConfigErrorKubernetes

Kubernetes: CreateContainerConfigError — secret / configmap not found

Kubernetes can’t build the container’s configuration — usually a referenced Secret, ConfigMap or key doesn’t exist in that namesp…

TokenExpiredErrorAuthentication

JWT Expired / Invalid Token

The JSON Web Token sent with the request is expired, malformed or signed with a different key, so the API rejects it (usually wit…

LF/CRLF warningGit

warning: in the working copy of 'x', LF will be replaced by CRLF the next time Git touches it

Git’s line-ending conversion (core.autocrlf) will change line endings in your working copy.

DataSource url not specifiedJava

Failed to configure a DataSource: 'url' attribute is not specified and no embedded datasource could be configured.

Spring Boot found JDBC/JPA on the classpath but no database URL.

AADSTS700016Azure

Azure AD (Entra ID): AADSTS700016 Application not found in the directory

The client ID in your sign-in request doesn’t exist in the tenant you’re authenticating against.

400HTTP

HTTP 400 Bad Request

The server could not understand the request because its syntax, headers or body are malformed or invalid.

invalid_grantAuthentication

OAuth 2.0 Error: invalid_grant

The authorization code, refresh token or credentials sent to the token endpoint are invalid, expired, already used or were issued…

open_basedirPHP

Warning: file_exists(): open_basedir restriction in effect. File(/x) is not within the allowed path(s)

PHP is configured to access only certain directories, and the script tried to touch a file outside them.

UPLOAD_ERR_INI_SIZEPHP

PHP upload error 1: The uploaded file exceeds the upload_max_filesize directive in php.ini

The uploaded file is bigger than PHP’s upload_max_filesize, so PHP discarded it.

api_version_invalidAPI

API Error: Invalid or unsupported API version

The API version you requested — in the URL, a header or the SDK config — doesn’t exist or has been retired.

DB connectionWordPress

WordPress: Error Establishing a Database Connection

WordPress can’t connect to its MySQL/MariaDB database with the credentials in wp-config.php, or the database server is down.

ENOTFOUNDAPI

Error: getaddrinfo ENOTFOUND host / Name or service not known

DNS lookup for the hostname failed — the name is wrong, doesn’t exist, or this machine can’t resolve it.

Could not resolve hostGit

fatal: unable to access 'https://github.com/…': Could not resolve host: github.com

DNS lookup for the Git host failed from this machine.

author identity unknownGit

Author identity unknown *** Please tell me who you are.

Git doesn’t know your name and email for commits.

1046MySQL

MySQL ERROR 1046 (3D000): No database selected

A query referenced tables without a database selected (no USE and no db in the connection).

1049MySQL

MySQL ERROR 1049 (42000): Unknown database 'x'

The database named in the connection doesn’t exist on that server.

not possible to fast-forwardGit

fatal: Not possible to fast-forward, aborting.

pull is configured to fast-forward only, but your branch and the remote have diverged.

1153MySQL

MySQL ERROR 1153 (08S01): Got a packet bigger than 'max_allowed_packet' bytes

A single statement or row exceeded max_allowed_packet — big BLOBs, huge INSERTs or large dump lines.

ERR_INVALID_ARG_TYPENode.js

TypeError [ERR_INVALID_ARG_TYPE]: The "path" argument must be of type string. Received undefined

A Node API got an argument of the wrong type — usually undefined because an env var or config value is missing.

419 Page ExpiredPHP

Laravel: 419 Page Expired (CSRF token mismatch)

Laravel rejected a POST because the CSRF token was missing, expired or didn’t match the session.

Target class does not existPHP

Laravel: Target class [App\Http\Controllers\X] does not exist.

Laravel’s container couldn’t find the controller or class named in a route or binding.

Laravel table not foundPHP

Laravel: SQLSTATE[42S02]: Base table or view not found: 1146 Table 'db.sessions' doesn't exist

Laravel queried a table that hasn’t been created — usually sessions, cache, jobs or a new model’s table.

403HTTP

HTTP 403 Forbidden

The server understood the request but refuses to authorize it — you (or the server process) are not allowed to access this resour…

npm update check failednpm

npm update check failed — Try running with sudo or get access to the local update config store

npm’s update notifier couldn’t write its config — usually root-owned files in ~/.config from a past sudo npm.

3D000PostgreSQL

FATAL: database "x" does not exist

The connection names a database that isn’t on that server.

NoCredentialsErrorAWS

AWS: Unable to locate credentials / Could not load credentials from any providers

The AWS CLI/SDK found no credentials in any place it looks — env vars, profile files, SSO cache or an instance/task role.

out of shared memoryPostgreSQL

ERROR: out of shared memory — HINT: You might need to increase max_locks_per_transaction.

A transaction took more locks than the lock table can hold — usually touching many tables/partitions at once.

ImproperlyConfiguredPython

django.core.exceptions.ImproperlyConfigured: settings are not configured / SECRET_KEY must not be empty

Django can’t load its settings — DJANGO_SETTINGS_MODULE unset, a required setting missing, or an environment variable not provide…

DisallowedHostPython

django.core.exceptions.DisallowedHost: Invalid HTTP_HOST header: 'x'. You may need to add 'x' to ALLOWED_HOSTS.

The request’s Host header isn’t listed in Django’s ALLOWED_HOSTS.

React must be in scopeReact

ReferenceError: React is not defined / 'React' must be in scope when using JSX

JSX was compiled with the classic runtime, which needs React imported in every file.

Network-related errorSQL

SQL Server: A network-related or instance-specific error occurred while establishing a connection to SQL Server. (provider: Named Pipes Provider, error: 40 / TCP Provider, error: 26)

The client couldn’t reach the SQL Server instance — wrong server name/instance, TCP disabled, firewall, or SQL Browser not runnin…

Maximum execution timePHP

PHP Fatal error: Maximum execution time of 30 seconds exceeded

The script ran longer than `max_execution_time` and PHP stopped it.

Critical errorWordPress

WordPress: There Has Been a Critical Error on This Website

A PHP fatal error (usually from a plugin or theme) stopped WordPress; the real error is in the debug log or recovery-mode email.

file_type_not_allowedAPI

Upload error: File type not allowed / unsupported file type

The upload was rejected because the file’s type — extension, MIME type or actual content — isn’t on the allowed list.