Error map

divergent branches hint: You have divergent branches and need to specify how to reconcile them.

Git · layer 7, Build & delivery

Open the full error page →

Centre: this error. First ring: errors it is linked with (12). Outer ring: what those are linked with. Colours show the layer of a request each error belongs to. Click any dot to re-centre the map on it; hover to follow its connections. The centre dot opens the error page.

divergent branches — hint: You have divergent branches and need to specify how to reconcile them. (Git)divergent b…DisallowedHost — django.core.exceptions.DisallowedHost: Invalid HTTP_HOST header: 'x'. You may need to add 'x' to ALLOWED_HOSTS. (Python)DisallowedHostgpg failed to sign — error: gpg failed to sign the data — fatal: failed to write commit object (Git)gpg failed to signDataSource url not specified — Failed to configure a DataSource: 'url' attribute is not specified and no embedded datasource could be configured. (Java)DataSource url not …ImproperlyConfigured — django.core.exceptions.ImproperlyConfigured: settings are not configured / SECRET_KEY must not be empty (Python)ImproperlyConfiguredsecretOrPrivateKey must have a value — Error: secretOrPrivateKey must have a value (jsonwebtoken sign) (Authentication)secretOrPrivateKey …redirect_uri_mismatch — OAuth Error: redirect_uri_mismatch (Authentication)redirect_uri_mismat…DB connection — WordPress: Error Establishing a Database Connection (WordPress)DB connection1046 — MySQL ERROR 1046 (3D000): No database selected (MySQL)1046PHP mail — PHP mail() returns false / emails not delivered (PHP)PHP mailauthor identity unknown — Author identity unknown *** Please tell me who you are. (Git)author identity unk…ERR_INVALID_ARG_TYPE — TypeError [ERR_INVALID_ARG_TYPE]: The "path" argument must be of type string. Received undefined (Node.js)ERR_INVALID_ARG_TYPE1000 — Cloudflare Error 1000: DNS points to prohibited IP (Cloudflare)1000400 — HTTP 400 Bad Request (HTTP)400Python not found — Python was not found; run without arguments to install from the Microsoft Store (Python)Python not foundDjango no such table — django.db.utils.OperationalError: no such table: app_model (Python)Django no such tableINSTALL_FAILED_UPDATE_INCOMPATIBLE — Android: INSTALL_FAILED_UPDATE_INCOMPATIBLE (Android)INSTALL_FAILED_UPDA…413 — HTTP 413 Content Too Large (Request Entity Too Large) (HTTP)413CreateContainerConfigError — Kubernetes: CreateContainerConfigError — secret / configmap not found (Kubernetes)CreateContainerConf…LF/CRLF warning — warning: in the working copy of 'x', LF will be replaced by CRLF the next time Git touches it (Git)LF/CRLF warningUnsatisfiedDependencyException — UnsatisfiedDependencyException / NoSuchBeanDefinitionException: No qualifying bean of type 'X' available (Java)UnsatisfiedDependen…circular references — The dependencies of some of the beans in the application context form a cycle (Java)circular referencesTemplateDoesNotExist — django.template.exceptions.TemplateDoesNotExist: app/page.html (Python)TemplateDoesNotExistDjango CSRF — Forbidden (403) CSRF verification failed. Request aborted. (Python)Django CSRFunpack error — ValueError: too many values to unpack (expected 2) (Python)unpack errorTokenExpiredError — JWT Expired / Invalid Token (Authentication)TokenExpiredError1049 — MySQL ERROR 1049 (42000): Unknown database 'x' (MySQL)10491153 — MySQL ERROR 1153 (08S01): Got a packet bigger than 'max_allowed_packet' bytes (MySQL)1153AADSTS700016 — Azure AD (Entra ID): AADSTS700016 Application not found in the directory (Azure)AADSTS700016invalid_grant — OAuth 2.0 Error: invalid_grant (Authentication)invalid_grantinvalid_client — OAuth 2.0 Error: invalid_client (Authentication)invalid_client1045 — MySQL ERROR 1045 (28000): Access denied for user (MySQL)10452002 — MySQL ERROR 2002 (HY000): Can't connect to local MySQL server through socket (MySQL)2002500 — HTTP 500 Internal Server Error (HTTP)500not a constructor — TypeError: x is not a constructor (JavaScript)not a constructorTDZ — ReferenceError: Cannot access 'x' before initialization (JavaScript)TDZ1227 — MySQL ERROR 1227 (42000): Access denied; you need (at least one of) the SUPER privilege(s) for this operation (MySQL)1227open_basedir — Warning: file_exists(): open_basedir restriction in effect. File(/x) is not within the allowed path(s) (PHP)open_basedirNo application encryption key — Laravel: No application encryption key has been specified. (PHP)No application encr…UPLOAD_ERR_INI_SIZE — PHP upload error 1: The uploaded file exceeds the upload_max_filesize directive in php.ini (PHP)UPLOAD_ERR_INI_SIZEnot a git repository — fatal: not a git repository (or any of the parent directories): .git (Git)not a git repositoryJAVA_HOME not set — ERROR: JAVA_HOME is not set and no 'java' command could be found in your PATH. (Java)JAVA_HOME not setENOENT — npm ERR! enoent ENOENT: no such file or directory, open '/path/package.json' (npm)ENOENTClassCastException — java.lang.ClassCastException: class A cannot be cast to class B (Java)ClassCastExceptionTS7016 — TS7016: Could not find a declaration file for module 'x'. 'x.js' implicitly has an 'any' type. (Node.js)TS7016TS2304 — TS2304: Cannot find name 'x'. (Node.js)TS2304ENOTFOUND — Error: getaddrinfo ENOTFOUND host / Name or service not known (API)ENOTFOUNDCould not resolve host — fatal: unable to access 'https://github.com/…': Could not resolve host: github.com (Git)Could not resolve h…UnknownHostException — java.net.UnknownHostException: api.example.com (Java)UnknownHostException

Directly related (12)

DisallowedHostPython

django.core.exceptions.DisallowedHost: Invalid HTTP_HOST header: 'x'. You may need to add 'x' to ALLOWED_HOSTS.

The request’s Host header isn’t listed in Django’s ALLOWED_HOSTS.

gpg failed to signGit

error: gpg failed to sign the data — fatal: failed to write commit object

Commit signing is enabled but GPG couldn’t sign — no TTY for the passphrase, wrong key, or agent not running.

DataSource url not specifiedJava

Failed to configure a DataSource: 'url' attribute is not specified and no embedded datasource could be configured.

Spring Boot found JDBC/JPA on the classpath but no database URL.

ImproperlyConfiguredPython

django.core.exceptions.ImproperlyConfigured: settings are not configured / SECRET_KEY must not be empty

Django can’t load its settings — DJANGO_SETTINGS_MODULE unset, a required setting missing, or an environment variable not provide…

secretOrPrivateKey must have a valueAuthentication

Error: secretOrPrivateKey must have a value (jsonwebtoken sign)

jwt.sign() got an empty secret — the environment variable holding the JWT secret isn’t loaded.

redirect_uri_mismatchAuthentication

OAuth Error: redirect_uri_mismatch

The redirect URI in your OAuth request doesn’t exactly match one registered for the client in the provider’s console.

DB connectionWordPress

WordPress: Error Establishing a Database Connection

WordPress can’t connect to its MySQL/MariaDB database with the credentials in wp-config.php, or the database server is down.

1046MySQL

MySQL ERROR 1046 (3D000): No database selected

A query referenced tables without a database selected (no USE and no db in the connection).

PHP mailPHP

PHP mail() returns false / emails not delivered

PHP’s mail() function failed or emails never arrive (spam or rejected).

author identity unknownGit

Author identity unknown *** Please tell me who you are.

Git doesn’t know your name and email for commits.

ERR_INVALID_ARG_TYPENode.js

TypeError [ERR_INVALID_ARG_TYPE]: The "path" argument must be of type string. Received undefined

A Node API got an argument of the wrong type — usually undefined because an env var or config value is missing.

1000Cloudflare

Cloudflare Error 1000: DNS points to prohibited IP

A proxied DNS record points at a Cloudflare IP address, creating a loop.

Two steps away (36)

400HTTP

HTTP 400 Bad Request

The server could not understand the request because its syntax, headers or body are malformed or invalid.

Python not foundPython

Python was not found; run without arguments to install from the Microsoft Store

Windows ran the Microsoft Store “App execution alias” instead of a real Python installation.

Django no such tablePython

django.db.utils.OperationalError: no such table: app_model

Django queried a table that hasn’t been created — migrations missing or not applied.

INSTALL_FAILED_UPDATE_INCOMPATIBLEAndroid

Android: INSTALL_FAILED_UPDATE_INCOMPATIBLE

An app with the same package name but a different signing key is already installed on the device.

413HTTP

HTTP 413 Content Too Large (Request Entity Too Large)

The request body is bigger than the server is willing to accept — usually a file upload over the configured limit.

CreateContainerConfigErrorKubernetes

Kubernetes: CreateContainerConfigError — secret / configmap not found

Kubernetes can’t build the container’s configuration — usually a referenced Secret, ConfigMap or key doesn’t exist in that namesp…

LF/CRLF warningGit

warning: in the working copy of 'x', LF will be replaced by CRLF the next time Git touches it

Git’s line-ending conversion (core.autocrlf) will change line endings in your working copy.

UnsatisfiedDependencyExceptionJava

UnsatisfiedDependencyException / NoSuchBeanDefinitionException: No qualifying bean of type 'X' available

Spring couldn’t find (or choose) a bean to inject.

circular referencesJava

The dependencies of some of the beans in the application context form a cycle

Two or more Spring beans depend on each other through constructors, and Spring Boot 2.6+ forbids cycles by default.

TemplateDoesNotExistPython

django.template.exceptions.TemplateDoesNotExist: app/page.html

Django searched all template directories and couldn’t find that template.

Django CSRFPython

Forbidden (403) CSRF verification failed. Request aborted.

Django rejected a POST because the CSRF token was missing, wrong, or the request origin isn’t trusted.

unpack errorPython

ValueError: too many values to unpack (expected 2)

Tuple unpacking got more (or fewer) values than variables on the left.

TokenExpiredErrorAuthentication

JWT Expired / Invalid Token

The JSON Web Token sent with the request is expired, malformed or signed with a different key, so the API rejects it (usually wit…

1049MySQL

MySQL ERROR 1049 (42000): Unknown database 'x'

The database named in the connection doesn’t exist on that server.

1153MySQL

MySQL ERROR 1153 (08S01): Got a packet bigger than 'max_allowed_packet' bytes

A single statement or row exceeded max_allowed_packet — big BLOBs, huge INSERTs or large dump lines.

AADSTS700016Azure

Azure AD (Entra ID): AADSTS700016 Application not found in the directory

The client ID in your sign-in request doesn’t exist in the tenant you’re authenticating against.

invalid_grantAuthentication

OAuth 2.0 Error: invalid_grant

The authorization code, refresh token or credentials sent to the token endpoint are invalid, expired, already used or were issued…

invalid_clientAuthentication

OAuth 2.0 Error: invalid_client

The OAuth server couldn’t authenticate your application — wrong client ID/secret, wrong auth method, or the client doesn’t exist…

1045MySQL

MySQL ERROR 1045 (28000): Access denied for user

MySQL rejected the login — wrong password, wrong user/host combination, or the user doesn’t exist.

2002MySQL

MySQL ERROR 2002 (HY000): Can't connect to local MySQL server through socket

The client couldn’t reach the MySQL server — it isn’t running, or the client is looking for the socket/port in the wrong place.

500HTTP

HTTP 500 Internal Server Error

The server hit an unexpected condition — usually an unhandled exception or misconfiguration in the application.

not a constructorJavaScript

TypeError: x is not a constructor

new was used with something that isn’t a class/constructor — usually a wrong import.

TDZJavaScript

ReferenceError: Cannot access 'x' before initialization

A let/const/class was used before its declaration line ran (temporal dead zone) — often a circular import.

1227MySQL

MySQL ERROR 1227 (42000): Access denied; you need (at least one of) the SUPER privilege(s) for this operation

The import or statement needs SUPER/SYSTEM_VARIABLES_ADMIN — typical with dumps containing DEFINER clauses or SET GLOBAL on manag…

open_basedirPHP

Warning: file_exists(): open_basedir restriction in effect. File(/x) is not within the allowed path(s)

PHP is configured to access only certain directories, and the script tried to touch a file outside them.

No application encryption keyPHP

Laravel: No application encryption key has been specified.

Laravel’s APP_KEY is missing, so it can’t encrypt sessions and cookies.

UPLOAD_ERR_INI_SIZEPHP

PHP upload error 1: The uploaded file exceeds the upload_max_filesize directive in php.ini

The uploaded file is bigger than PHP’s upload_max_filesize, so PHP discarded it.

not a git repositoryGit

fatal: not a git repository (or any of the parent directories): .git

You ran a Git command outside a Git working tree.

JAVA_HOME not setJava

ERROR: JAVA_HOME is not set and no 'java' command could be found in your PATH.

Build tools (Gradle, Maven, Android tools) can’t find a JDK.

ENOENTnpm

npm ERR! enoent ENOENT: no such file or directory, open '/path/package.json'

npm ran in a directory without a package.json.

ClassCastExceptionJava

java.lang.ClassCastException: class A cannot be cast to class B

An object was cast to a type it isn’t.

TS7016Node.js

TS7016: Could not find a declaration file for module 'x'. 'x.js' implicitly has an 'any' type.

The JavaScript package has no TypeScript types bundled and no @types package installed.

TS2304Node.js

TS2304: Cannot find name 'x'.

TypeScript doesn’t know an identifier — a missing import, missing type definitions (e.g. for Node or Jest globals), or a typo.

ENOTFOUNDAPI

Error: getaddrinfo ENOTFOUND host / Name or service not known

DNS lookup for the hostname failed — the name is wrong, doesn’t exist, or this machine can’t resolve it.

Could not resolve hostGit

fatal: unable to access 'https://github.com/…': Could not resolve host: github.com

DNS lookup for the Git host failed from this machine.

UnknownHostExceptionJava

java.net.UnknownHostException: api.example.com

DNS resolution failed for the hostname.