Error map

service connection could not be found Azure Pipelines: There was a resource authorization issue: The pipeline is not valid. Could not find a service connection with identifier x

Azure · layer 6, Platform & cloud

Open the full error page →

Centre: this error. First ring: errors it is linked with (12). Outer ring: what those are linked with. Colours show the layer of a request each error belongs to. Click any dot to re-centre the map on it; hover to follow its connections. The centre dot opens the error page.

service connection could not be found — Azure Pipelines: There was a resource authorization issue: The pipeline is not valid. Could not find a service connection with identifier x (Azure)service con…github-actions[bot] 403 — remote: Permission to owner/repo.git denied to github-actions[bot]. fatal: unable to access … The requested URL returned error: 403 (Git)github-actions[bot]…npm ci out of sync — npm ERR! `npm ci` can only install packages when your package.json and package-lock.json are in sync (npm)npm ci out of syncanother operation is in progress — Error: UPGRADE FAILED: another operation (install/upgrade/rollback) is in progress (Kubernetes)another operation i…10000 — wrangler / Cloudflare API: Authentication error [code: 10000] (Cloudflare)10000No updates are to be performed — CloudFormation: No updates are to be performed (AWS)No updates are to b…shallow update not allowed — ! [remote rejected] main -> main (shallow update not allowed) (Git)shallow update not …the input device is not a TTY — the input device is not a TTY (Docker)the input device is…TF401019 — TF401019: The Git repository with name or identifier x does not exist or you do not have permissions for the operation (Azure)TF401019Failed to find target with hash string — Failed to find target with hash string 'android-34' / Failed to install the following Android SDK packages as some licences have not been accepted (Android)Failed to find targ…npm ci no lockfile — npm ERR! The `npm ci` command can only install with an existing package-lock.json or npm-shrinkwrap.json (npm)npm ci no lockfileYN0028 — YN0028: The lockfile would have been modified by this install, which is explicitly forbidden. (npm)YN0028toomanyrequests — toomanyrequests: You have reached your pull rate limit (Docker Hub) (Docker)toomanyrequests403 — HTTP 403 Forbidden (HTTP)403protected branch — remote: error: GH006: Protected branch update failed / pre-receive hook declined (Git)protected branchworkflow scope — ! [remote rejected] … (refusing to allow a Personal Access Token to create or update workflow `.github/workflows/x.yml` without `workflow` scope) (Git)workflow scopeEINTEGRITY — npm ERR! code EINTEGRITY — sha512 integrity checksum failed (npm)EINTEGRITYold lockfile — npm WARN old lockfile — The package-lock.json file was created with an old version of npm, so supplemental metadata must be fetched (npm)old lockfilerollup native module — Error: Cannot find module @rollup/rollup-linux-x64-gnu. npm has a bug related to optional dependencies (npm)rollup native modulecannot re-use a name that is still in use — Error: INSTALLATION FAILED: cannot re-use a name that is still in use (Kubernetes)cannot re-use a nam…invalid ownership metadata — rendered manifests contain a resource that already exists. Unable to continue with install: ... invalid ownership metadata (Kubernetes)invalid ownership m…ProgressDeadlineExceeded — deployment "x" exceeded its progress deadline (ProgressDeadlineExceeded) (Kubernetes)ProgressDeadlineExc…401 — HTTP 401 Unauthorized (HTTP)401No hosted parallelism — Azure Pipelines: No hosted parallelism has been purchased or granted (Azure)No hosted paralleli…1019 — Cloudflare Error 1019: Compute server error (Workers) (Cloudflare)1019ERR_PNPM_OUTDATED_LOCKFILE — ERR_PNPM_OUTDATED_LOCKFILE Cannot install with "frozen-lockfile" because pnpm-lock.yaml is not up to date with package.json (npm)ERR_PNPM_OUTDATED_L…ROLLBACK_COMPLETE — Stack is in ROLLBACK_COMPLETE state and can not be updated (AWS)ROLLBACK_COMPLETEUPDATE_ROLLBACK_FAILED — CloudFormation stack in UPDATE_ROLLBACK_FAILED (AWS)UPDATE_ROLLBACK_FAI…non-fast-forward — Git: ! [rejected] … (fetch first) — error: failed to push some refs (Git)non-fast-forwardRPC failed — error: RPC failed; HTTP 400 curl 22 / curl 92 HTTP/2 stream was not closed cleanly — the remote end hung up unexpectedly (Git)RPC failedGH001 large files — remote: error: GH001: Large files detected. File x is 120 MB; this exceeds GitHub's file size limit of 100.00 MB (Git)GH001 large filesinvalid reference format — docker: invalid reference format (repository name must be lowercase) (Docker)invalid reference f…No such container — Error response from daemon: No such container (Docker)No such containeris not running — Error response from daemon: Container X is not running (Docker)is not runningEACCES — npm ERR! code EACCES — permission denied (npm)EACCESdaemon — Cannot connect to the Docker daemon at unix:///var/run/docker.sock. Is the docker daemon running? (Docker)daemoninvalid_scope — OAuth 2.0 Error: invalid_scope / insufficient_scope (Authentication)invalid_scopeCould not resolve — Gradle: Could not resolve all files for configuration / Could not resolve dependency (Android)Could not resolveAADSTS70021 — AADSTS70021: No matching federated identity record found for presented assertion (GitHub Actions / workload identity) (Azure)AADSTS70021DefaultAzureCredential failed — DefaultAzureCredential failed to retrieve a token from the included credentials / ManagedIdentityCredential authentication unavailable (Azure)DefaultAzureCredent…Invalid Version — npm ERR! Invalid Version: (semver parse error) (npm)Invalid VersionGradle Java heap space — Gradle: Expiring Daemon because JVM heap space is exhausted / java.lang.OutOfMemoryError: Java heap space during build (Android)Gradle Java heap sp…Command CodeSign failed — Command CodeSign failed with a nonzero exit code (errSecInternalComponent / resource fork, Finder information not allowed) (iOS)Command CodeSign fa…ImagePullBackOff — Kubernetes: ImagePullBackOff / ErrImagePull (Kubernetes)ImagePullBackOff429 — HTTP 429 Too Many Requests (HTTP)429ProvisionedThroughputExceededException — ProvisionedThroughputExceededException: The level of configured provisioned throughput for the table was exceeded (AWS)ProvisionedThroughp…

Directly related (12)

github-actions[bot] 403Git

remote: Permission to owner/repo.git denied to github-actions[bot]. fatal: unable to access … The requested URL returned error: 403

A GitHub Actions workflow tried to push but the GITHUB_TOKEN doesn’t have write permission.

npm ci out of syncnpm

npm ERR! `npm ci` can only install packages when your package.json and package-lock.json are in sync

package-lock.json doesn’t match package.json, so npm ci refuses to install.

another operation is in progressKubernetes

Error: UPGRADE FAILED: another operation (install/upgrade/rollback) is in progress

A previous Helm operation on this release was interrupted and left it in a pending-install/pending-upgrade state, so Helm refuses…

10000Cloudflare

wrangler / Cloudflare API: Authentication error [code: 10000]

The Cloudflare API rejected the token — it’s invalid, expired, missing permissions, or scoped to another account/zone.

No updates are to be performedAWS

CloudFormation: No updates are to be performed

You ran an update/deploy with a template and parameters identical to what’s deployed, so there’s nothing to change.

shallow update not allowedGit

! [remote rejected] main -> main (shallow update not allowed)

You pushed from a shallow clone to a remote that doesn’t accept shallow history.

the input device is not a TTYDocker

the input device is not a TTY

docker run/exec was called with -t (allocate a terminal) in a context with no terminal — CI, cron, a pipe or a script.

TF401019Azure

TF401019: The Git repository with name or identifier x does not exist or you do not have permissions for the operation

The repo doesn’t exist in that project, or the identity (user, PAT, pipeline build service) lacks permission to it.

Failed to find target with hash stringAndroid

Failed to find target with hash string 'android-34' / Failed to install the following Android SDK packages as some licences have not been accepted

Gradle needs an SDK platform/build-tools that isn’t installed, or the licences haven’t been accepted on this machine.

npm ci no lockfilenpm

npm ERR! The `npm ci` command can only install with an existing package-lock.json or npm-shrinkwrap.json

npm ci needs a committed lockfile and didn’t find one.

YN0028npm

YN0028: The lockfile would have been modified by this install, which is explicitly forbidden.

Yarn Berry’s immutable install in CI found the lockfile needs changes.

toomanyrequestsDocker

toomanyrequests: You have reached your pull rate limit (Docker Hub)

Docker Hub limits anonymous and free pulls; your IP or account has used its quota for the current window.

Two steps away (33)

403HTTP

HTTP 403 Forbidden

The server understood the request but refuses to authorize it — you (or the server process) are not allowed to access this resour…

protected branchGit

remote: error: GH006: Protected branch update failed / pre-receive hook declined

The server rejected your push because of branch protection rules or a server-side hook.

workflow scopeGit

! [remote rejected] … (refusing to allow a Personal Access Token to create or update workflow `.github/workflows/x.yml` without `workflow` scope)

Your token can’t modify GitHub Actions workflow files without the workflow scope.

EINTEGRITYnpm

npm ERR! code EINTEGRITY — sha512 integrity checksum failed

A downloaded package’s hash doesn’t match the integrity value in package-lock.json — a corrupted cache, a changed tarball, or a l…

old lockfilenpm

npm WARN old lockfile — The package-lock.json file was created with an old version of npm, so supplemental metadata must be fetched

The lockfile is lockfileVersion 1 (npm 6) and npm 7+ is upgrading it.

rollup native modulenpm

Error: Cannot find module @rollup/rollup-linux-x64-gnu. npm has a bug related to optional dependencies

Rollup’s (and Vite’s) platform-specific optional dependency wasn’t installed — an npm optional-dependency bug with lockfiles from…

cannot re-use a name that is still in useKubernetes

Error: INSTALLATION FAILED: cannot re-use a name that is still in use

helm install was run with a release name that already exists in the namespace (even a failed one).

invalid ownership metadataKubernetes

rendered manifests contain a resource that already exists. Unable to continue with install: ... invalid ownership metadata

Helm wants to create an object that already exists but isn’t labelled as belonging to this release.

ProgressDeadlineExceededKubernetes

deployment "x" exceeded its progress deadline (ProgressDeadlineExceeded)

A rollout didn’t make progress within progressDeadlineSeconds (default 600) — new pods never became ready.

401HTTP

HTTP 401 Unauthorized

The request has no valid authentication credentials — you need to log in or send a valid token.

No hosted parallelismAzure

Azure Pipelines: No hosted parallelism has been purchased or granted

The Azure DevOps organization has no Microsoft-hosted parallel jobs, so pipelines can’t run on hosted agents.

1019Cloudflare

Cloudflare Error 1019: Compute server error (Workers)

A Cloudflare Worker routed the request to a loop or hit an internal compute error.

ERR_PNPM_OUTDATED_LOCKFILEnpm

ERR_PNPM_OUTDATED_LOCKFILE Cannot install with "frozen-lockfile" because pnpm-lock.yaml is not up to date with package.json

pnpm’s lockfile doesn’t match package.json, and CI installs with a frozen lockfile.

ROLLBACK_COMPLETEAWS

Stack is in ROLLBACK_COMPLETE state and can not be updated

The stack’s first creation failed and rolled back; a stack in ROLLBACK_COMPLETE can only be deleted, not updated.

UPDATE_ROLLBACK_FAILEDAWS

CloudFormation stack in UPDATE_ROLLBACK_FAILED

An update failed, and then the rollback also failed, leaving the stack stuck until you continue the rollback.

non-fast-forwardGit

Git: ! [rejected] … (fetch first) — error: failed to push some refs

The remote branch has commits you don’t have locally, so Git refuses to overwrite them. Pull (merge or rebase) first, then push.

RPC failedGit

error: RPC failed; HTTP 400 curl 22 / curl 92 HTTP/2 stream was not closed cleanly — the remote end hung up unexpectedly

A large HTTPS push/clone broke mid-transfer — size limits, proxies or flaky HTTP/2.

GH001 large filesGit

remote: error: GH001: Large files detected. File x is 120 MB; this exceeds GitHub's file size limit of 100.00 MB

GitHub rejected the push because a file over 100 MB is in your commits — even if you deleted it later.

invalid reference formatDocker

docker: invalid reference format (repository name must be lowercase)

Docker couldn’t parse the image name — uppercase letters, spaces, an empty variable, or a misplaced option.

No such containerDocker

Error response from daemon: No such container

The container name or ID you used doesn’t exist on this Docker host — it was removed, has another name, or you’re talking to a di…

is not runningDocker

Error response from daemon: Container X is not running

You tried to exec into or interact with a container that has stopped.

EACCESnpm

npm ERR! code EACCES — permission denied

npm can’t write to a directory — usually global installs into a root-owned folder.

daemonDocker

Cannot connect to the Docker daemon at unix:///var/run/docker.sock. Is the docker daemon running?

The docker CLI can’t talk to the Docker engine — it isn’t running, or your user can’t access the socket.

invalid_scopeAuthentication

OAuth 2.0 Error: invalid_scope / insufficient_scope

The requested scope is unknown or not allowed for this client — or the token lacks the scope the API endpoint requires.

Could not resolveAndroid

Gradle: Could not resolve all files for configuration / Could not resolve dependency

Gradle couldn’t download a dependency — wrong coordinates/version, missing repository, offline mode, or network/proxy issues.

AADSTS70021Azure

AADSTS70021: No matching federated identity record found for presented assertion (GitHub Actions / workload identity)

The OIDC token from GitHub Actions/Kubernetes/another IdP doesn’t match any federated credential on the app — issuer, subject or…

DefaultAzureCredential failedAzure

DefaultAzureCredential failed to retrieve a token from the included credentials / ManagedIdentityCredential authentication unavailable

The Azure SDK tried every credential source (env vars, workload identity, managed identity, CLI…) and none worked.

Invalid Versionnpm

npm ERR! Invalid Version: (semver parse error)

A package.json or lockfile contains a version string that isn’t valid semver.

Gradle Java heap spaceAndroid

Gradle: Expiring Daemon because JVM heap space is exhausted / java.lang.OutOfMemoryError: Java heap space during build

The Gradle daemon (or Kotlin daemon) ran out of memory compiling or dexing the project.

Command CodeSign failediOS

Command CodeSign failed with a nonzero exit code (errSecInternalComponent / resource fork, Finder information not allowed)

codesign failed — the keychain is locked (CI/SSH), the private key is inaccessible, or files carry extended attributes that can’t…

ImagePullBackOffKubernetes

Kubernetes: ImagePullBackOff / ErrImagePull

The node can’t pull the container image — wrong name/tag, missing registry credentials, or registry unreachable.

429HTTP

HTTP 429 Too Many Requests

You’ve hit a rate limit — too many requests in a given time window. Slow down and retry later.

ProvisionedThroughputExceededExceptionAWS

ProvisionedThroughputExceededException: The level of configured provisioned throughput for the table was exceeded

Requests exceed the table’s (or index’s) provisioned read/write capacity, or one partition is hot.