Error map

ROLLBACK_COMPLETE Stack is in ROLLBACK_COMPLETE state and can not be updated

AWS · layer 6, Platform & cloud

Open the full error page →

Centre: this error. First ring: errors it is linked with (11). Outer ring: what those are linked with. Colours show the layer of a request each error belongs to. Click any dot to re-centre the map on it; hover to follow its connections. The centre dot opens the error page.

ROLLBACK_COMPLETE — Stack is in ROLLBACK_COMPLETE state and can not be updated (AWS)ROLLBACK_CO…Environment health has transitioned to Severe — Elastic Beanstalk: Environment health has transitioned from Ok to Severe (AWS)Environment health …ProgressDeadlineExceeded — deployment "x" exceeded its progress deadline (ProgressDeadlineExceeded) (Kubernetes)ProgressDeadlineExc…InvalidTemplateDeployment — ARM/Bicep: DeploymentFailed / InvalidTemplateDeployment / InvalidTemplate (Azure)InvalidTemplateDepl…No updates are to be performed — CloudFormation: No updates are to be performed (AWS)No updates are to b…Output directory not found — Cloudflare Pages build: Error: Output directory "dist" not found / Failed: build output directory not found (Cloudflare)Output directory no…No job functions found — Azure Functions: No job functions found. Try making your job classes and methods public / Error indexing method (Azure)No job functions fo…UPDATE_ROLLBACK_FAILED — CloudFormation stack in UPDATE_ROLLBACK_FAILED (AWS)UPDATE_ROLLBACK_FAI…already exists in stack — CloudFormation: Resource ... already exists (AlreadyExists / already exists in stack) (AWS)already exists in s…Multi-Attach error — Multi-Attach error for volume: Volume is already exclusively attached to one node and can't be attached to another (Kubernetes)Multi-Attach errorfield is immutable — The Deployment is invalid: spec.selector: Invalid value: field is immutable (Kubernetes)field is immutable1104 — Cloudflare Error 1104: A variation of this script was not found (Worker route to deleted script) (Cloudflare)1104502 — HTTP 502 Bad Gateway (HTTP)502503 — HTTP 503 Service Unavailable (HTTP)503MessageRejected — SES MessageRejected: Email address is not verified. The following identities failed the check in region (AWS)MessageRejectedCrashLoopBackOff — Kubernetes: CrashLoopBackOff (Kubernetes)CrashLoopBackOffImagePullBackOff — Kubernetes: ImagePullBackOff / ErrImagePull (Kubernetes)ImagePullBackOffReadiness probe failed — Readiness probe failed: HTTP probe failed with statuscode: 503 / connect: connection refused (Kubernetes)Readiness probe fai…SkuNotAvailable — Azure: SkuNotAvailable / QuotaExceeded when creating a VM or resource (Azure)SkuNotAvailableResourceGroupNotFound — ResourceGroupNotFound: Resource group 'x' could not be found (Azure)ResourceGroupNotFou…ResourceNotFound — ResourceNotFound: The Resource 'Microsoft.X/...' under resource group 'y' was not found (Azure)ResourceNotFoundshallow update not allowed — ! [remote rejected] main -> main (shallow update not allowed) (Git)shallow update not …github-actions[bot] 403 — remote: Permission to owner/repo.git denied to github-actions[bot]. fatal: unable to access … The requested URL returned error: 403 (Git)github-actions[bot]…npm ci out of sync — npm ERR! `npm ci` can only install packages when your package.json and package-lock.json are in sync (npm)npm ci out of syncELIFECYCLE — npm ERR! code ELIFECYCLE / Command failed with exit code 1 (npm)ELIFECYCLEgyp ERR! — gyp ERR! build error / node-gyp rebuild failed (npm)gyp ERR!COPY failed — COPY failed: file not found in build context / "/app/x": not found (Docker)COPY failedApp Service Application Error — Azure App Service: ":( Application Error" / container didn’t respond to HTTP pings (Azure)App Service Applica…AzureWebJobsStorage — Azure Functions: Value cannot be null. (Parameter 'connectionString') / Missing value for AzureWebJobsStorage (Azure)AzureWebJobsStorageTypeError not callable — TypeError: 'str' object is not callable (Python)TypeError not calla…ALREADY_EXISTS — API Error: Resource already exists (ALREADY_EXISTS / resource_already_exists / 409) (API)ALREADY_EXISTSIAM AccessDeniedException — AccessDeniedException: User: arn:aws:iam::... is not authorized to perform: service:Action on resource: ... (AWS)IAM AccessDeniedExc…AuthorizationPermissionMismatch — Azure Storage: AuthorizationPermissionMismatch (403) — This request is not authorized to perform this operation using this permission (Azure)AuthorizationPermis…QuotaExceededError — QuotaExceededError: Failed to execute 'setItem' on 'Storage': Setting the value exceeded the quota (JavaScript)QuotaExceededError126 incorrect key file — MySQL ERROR 126 (HY000): Incorrect key file for table; try to repair it (MySQL)126 incorrect key f…AlreadyExists — Error from server (AlreadyExists): ... already exists (Kubernetes)AlreadyExistsunknown field — strict decoding error: unknown field "spec.template.spec.containers[0].ports[0].protocl" (Kubernetes)unknown fieldthe object has been modified — Operation cannot be fulfilled on deployments.apps "x": the object has been modified; please apply your changes to the latest version and try again (Kubernetes)the object has been…1019 — Cloudflare Error 1019: Compute server error (Workers) (Cloudflare)10191025 — Cloudflare Error 1025: Please check back later (Workers request limit) (Cloudflare)10251101 — Cloudflare Error 1101: Worker threw exception (Cloudflare)1101

Directly related (11)

Environment health has transitioned to SevereAWS

Elastic Beanstalk: Environment health has transitioned from Ok to Severe

Most instances in the Elastic Beanstalk environment are failing health checks or returning errors.

ProgressDeadlineExceededKubernetes

deployment "x" exceeded its progress deadline (ProgressDeadlineExceeded)

A rollout didn’t make progress within progressDeadlineSeconds (default 600) — new pods never became ready.

InvalidTemplateDeploymentAzure

ARM/Bicep: DeploymentFailed / InvalidTemplateDeployment / InvalidTemplate

An Azure Resource Manager (ARM/Bicep/Terraform) deployment failed; the inner error under “details” has the real cause.

No updates are to be performedAWS

CloudFormation: No updates are to be performed

You ran an update/deploy with a template and parameters identical to what’s deployed, so there’s nothing to change.

Output directory not foundCloudflare

Cloudflare Pages build: Error: Output directory "dist" not found / Failed: build output directory not found

The Pages build finished, but the folder set as “Build output directory” doesn’t exist — the framework wrote its files somewhere…

No job functions foundAzure

Azure Functions: No job functions found. Try making your job classes and methods public / Error indexing method

The Functions host started but couldn’t discover or index any functions — wrong project structure, extension/binding problems or…

UPDATE_ROLLBACK_FAILEDAWS

CloudFormation stack in UPDATE_ROLLBACK_FAILED

An update failed, and then the rollback also failed, leaving the stack stuck until you continue the rollback.

already exists in stackAWS

CloudFormation: Resource ... already exists (AlreadyExists / already exists in stack)

The template tries to create a resource with a fixed name that already exists — created manually, by another stack, or left over…

Multi-Attach errorKubernetes

Multi-Attach error for volume: Volume is already exclusively attached to one node and can't be attached to another

A ReadWriteOnce volume (EBS, Azure Disk, PD) is still attached to another node, so the new pod on a different node can’t use it.

field is immutableKubernetes

The Deployment is invalid: spec.selector: Invalid value: field is immutable

You tried to change a field Kubernetes doesn’t allow to change after creation — Deployment selectors, Job templates, Service clus…

1104Cloudflare

Cloudflare Error 1104: A variation of this script was not found (Worker route to deleted script)

A Worker route points to a script that no longer exists (deleted, renamed or not deployed to that environment).

Two steps away (29)

502HTTP

HTTP 502 Bad Gateway

A proxy or gateway (Nginx, load balancer, CDN) got an invalid response — or no response — from the upstream server behind it.

503HTTP

HTTP 503 Service Unavailable

The server is temporarily unable to handle the request — overloaded, in maintenance, or has no healthy backends.

MessageRejectedAWS

SES MessageRejected: Email address is not verified. The following identities failed the check in region

SES refused to send because the From address/domain isn’t verified — or the account is still in the SES sandbox, where recipients…

CrashLoopBackOffKubernetes

Kubernetes: CrashLoopBackOff

The container starts, crashes (or exits), and Kubernetes keeps restarting it with increasing back-off delays.

ImagePullBackOffKubernetes

Kubernetes: ImagePullBackOff / ErrImagePull

The node can’t pull the container image — wrong name/tag, missing registry credentials, or registry unreachable.

Readiness probe failedKubernetes

Readiness probe failed: HTTP probe failed with statuscode: 503 / connect: connection refused

The container is running, but its readiness check fails, so the pod is marked not ready and removed from Service endpoints.

SkuNotAvailableAzure

Azure: SkuNotAvailable / QuotaExceeded when creating a VM or resource

The VM size isn’t offered in that region/zone for your subscription, or you’ve hit the vCPU quota.

ResourceGroupNotFoundAzure

ResourceGroupNotFound: Resource group 'x' could not be found

The resource group doesn’t exist in the subscription the command or deployment is using.

ResourceNotFoundAzure

ResourceNotFound: The Resource 'Microsoft.X/...' under resource group 'y' was not found

The specific resource doesn’t exist in that resource group/subscription — wrong name, group or subscription, or it was deleted.

shallow update not allowedGit

! [remote rejected] main -> main (shallow update not allowed)

You pushed from a shallow clone to a remote that doesn’t accept shallow history.

github-actions[bot] 403Git

remote: Permission to owner/repo.git denied to github-actions[bot]. fatal: unable to access … The requested URL returned error: 403

A GitHub Actions workflow tried to push but the GITHUB_TOKEN doesn’t have write permission.

npm ci out of syncnpm

npm ERR! `npm ci` can only install packages when your package.json and package-lock.json are in sync

package-lock.json doesn’t match package.json, so npm ci refuses to install.

ELIFECYCLEnpm

npm ERR! code ELIFECYCLE / Command failed with exit code 1

An npm script (build, start, test, postinstall) exited with an error. ELIFECYCLE is only the wrapper — the real error is printed…

gyp ERR!npm

gyp ERR! build error / node-gyp rebuild failed

A dependency with native C/C++ code couldn’t compile — missing build tools, Python, or an unsupported Node version.

COPY failedDocker

COPY failed: file not found in build context / "/app/x": not found

The Dockerfile COPY refers to a path outside the build context, excluded by .dockerignore, or relative to the wrong directory.

App Service Application ErrorAzure

Azure App Service: ":( Application Error" / container didn’t respond to HTTP pings

App Service started your app but it crashed or never listened on the expected port.

AzureWebJobsStorageAzure

Azure Functions: Value cannot be null. (Parameter 'connectionString') / Missing value for AzureWebJobsStorage

A Functions app setting or binding connection string is missing — most often AzureWebJobsStorage locally (local.settings.json) or…

TypeError not callablePython

TypeError: 'str' object is not callable

You used parentheses on something that isn’t a function — often a variable shadowing a built-in.

ALREADY_EXISTSAPI

API Error: Resource already exists (ALREADY_EXISTS / resource_already_exists / 409)

The create request was refused because an object with the same unique identity — name, email, external ID — already exists.

IAM AccessDeniedExceptionAWS

AccessDeniedException: User: arn:aws:iam::... is not authorized to perform: service:Action on resource: ...

The IAM user or role making the call has no permission for that action on that resource — the message names both.

AuthorizationPermissionMismatchAzure

Azure Storage: AuthorizationPermissionMismatch (403) — This request is not authorized to perform this operation using this permission

You’re accessing blob/queue data with Microsoft Entra ID, but the identity has only management roles (Owner/Contributor) — not a…

QuotaExceededErrorJavaScript

QuotaExceededError: Failed to execute 'setItem' on 'Storage': Setting the value exceeded the quota

localStorage/sessionStorage is full (about 5 MB per origin) or storage is disabled.

126 incorrect key fileMySQL

MySQL ERROR 126 (HY000): Incorrect key file for table; try to repair it

MySQL can’t use a table’s index file — usually a full tmp disk during a query, or MyISAM corruption.

AlreadyExistsKubernetes

Error from server (AlreadyExists): ... already exists

kubectl create tried to make an object whose name is already taken in that namespace.

unknown fieldKubernetes

strict decoding error: unknown field "spec.template.spec.containers[0].ports[0].protocl"

The manifest contains a field the API schema doesn’t know — a typo, wrong indentation, or a field from another API version.

the object has been modifiedKubernetes

Operation cannot be fulfilled on deployments.apps "x": the object has been modified; please apply your changes to the latest version and try again

Optimistic-concurrency conflict: the object changed (new resourceVersion) between when you read it and when you tried to update i…

1019Cloudflare

Cloudflare Error 1019: Compute server error (Workers)

A Cloudflare Worker routed the request to a loop or hit an internal compute error.

1025Cloudflare

Cloudflare Error 1025: Please check back later (Workers request limit)

The site’s Cloudflare Workers plan exceeded its daily request limit (free plan: 100,000 requests/day).

1101Cloudflare

Cloudflare Error 1101: Worker threw exception

The Cloudflare Worker serving this route threw an uncaught JavaScript exception.