Error map

actively refused it HttpRequestException: No connection could be made because the target machine actively refused it (localhost:5001)

.NET · layer 4, Application & API

Open the full error page →

Centre: this error. First ring: errors it is linked with (12). Outer ring: what those are linked with. Colours show the layer of a request each error belongs to. Click any dot to re-centre the map on it; hover to follow its connections. The centre dot opens the error page.

actively refused it — HttpRequestException: No connection could be made because the target machine actively refused it (localhost:5001) (.NET)actively re…NetworkOnMainThreadException — android.os.NetworkOnMainThreadException (Android)NetworkOnMainThread…is an invalid start of a value — System.Text.Json: '<' is an invalid start of a value. Path: $ | LineNumber: 0 | BytePositionInLine: 0 (.NET)is an invalid start…DNS in pod — DNS not working inside a Kubernetes pod (could not resolve host / nslookup: can't resolve) (Kubernetes)DNS in podFailedCreatePodSandBox — Failed to create pod sandbox: plugin type="calico" failed (add): ... (FailedCreatePodSandBox) (Kubernetes)FailedCreatePodSand…provided port is not in the valid range — spec.ports[0].nodePort: Invalid value: 80: provided port is not in the valid range. The range of valid ports is 30000-32767 (Kubernetes)provided port is no…HttpClient.Timeout — TaskCanceledException: The request was canceled due to the configured HttpClient.Timeout of 100 seconds elapsing (.NET)HttpClient.TimeoutECONNREFUSED — Error: connect ECONNREFUSED 127.0.0.1:5432 (Node.js)ECONNREFUSEDCannotPullContainerError — ECS task stopped: CannotPullContainerError: pull image manifest has been retried ... / ref pull has been retried (AWS)CannotPullContainer…Pool overlaps — Error response from daemon: Pool overlaps with other one on this address space (Docker)Pool overlapsiptables: No chain/target/match — driver failed programming external connectivity on endpoint: iptables: No chain/target/match by that name (Docker)iptables: No chain/…Failed to bind to address — System.IO.IOException: Failed to bind to address http://127.0.0.1:5000: address already in use (.NET)Failed to bind to a…The SSL connection could not be established — HttpRequestException: The SSL connection could not be established, see inner exception. (AuthenticationException: The remote certificate is invalid) (.NET)The SSL connection …network not found — Error response from daemon: network X not found (Docker)network not founddefault backend - 404 — Ingress returns "404 Not Found" / "default backend - 404" (ingress-nginx) (Kubernetes)default backend - 4…no endpoints — Service has no endpoints (no endpoints available for service / Endpoints: <none>) (Kubernetes)no endpointsSyntaxError: JSON — SyntaxError: Unexpected token < in JSON at position 0 (JavaScript)SyntaxError: JSONMismatchedInputException — com.fasterxml.jackson.databind.exc.MismatchedInputException: Cannot deserialize value of type `java.util.ArrayList` from Object value (Java)MismatchedInputExce…UnrecognizedPropertyException — com.fasterxml.jackson.databind.exc.UnrecognizedPropertyException: Unrecognized field "x", not marked as ignorable (Java)UnrecognizedPropert…ENOTFOUND — Error: getaddrinfo ENOTFOUND host / Name or service not known (API)ENOTFOUNDERR_NAME_NOT_RESOLVED — net::ERR_NAME_NOT_RESOLVED (This site can't be reached — server IP address could not be found) (JavaScript)ERR_NAME_NOT_RESOLV…cURL error 6 — cURL error 6: Could not resolve host: api.example.com (PHP)cURL error 6Evicted — Kubernetes: Pod Evicted — The node was low on resource: memory / ephemeral-storage (Kubernetes)EvictedNotReady — Kubernetes node NotReady (Kubelet stopped posting node status) (Kubernetes)NotReadyNSURLErrorDomain Code=-1001 — Error Domain=NSURLErrorDomain Code=-1001 "The request timed out." (iOS)NSURLErrorDomain Co…Job for x.service failed — Job for nginx.service failed because the control process exited with error code (Linux)Job for x.service f…Unit not found — Failed to start x.service: Unit x.service not found (Linux)Unit not foundStart request repeated too quickly — systemd: Start request repeated too quickly / service hit its start limit (Linux)Start request repea…2006 — MySQL ERROR 2006 (HY000): MySQL server has gone away (MySQL)2006408 — HTTP 408 Request Timeout (HTTP)408504 — HTTP 504 Gateway Timeout (HTTP)5042002 — MySQL ERROR 2002 (HY000): Can't connect to local MySQL server through socket (MySQL)2002EADDRINUSE — Error: listen EADDRINUSE: address already in use :::3000 (Node.js)EADDRINUSEFailed to fetch — TypeError: Failed to fetch / NetworkError when attempting to fetch resource (JavaScript)Failed to fetchImagePullBackOff — Kubernetes: ImagePullBackOff / ErrImagePull (Kubernetes)ImagePullBackOffEROFS — npm ERR! code EROFS — EROFS: read-only file system (npm)EROFSECR token expired — denied: Your authorization token has expired. Reauthenticate and try again. (Amazon ECR) (AWS)ECR token expiredcompose validation — docker compose: services.x Additional property y is not allowed / yaml: line N: mapping values are not allowed (Docker)compose validationdocker-compose: command not found — docker-compose: command not found / 'compose' is not a docker command (Docker)docker-compose: com…depends on undefined service — service "web" depends on undefined service "db": invalid compose project (Docker)depends on undefine…port is already allocated — Docker: Bind for 0.0.0.0:80 failed: port is already allocated (Docker)port is already all…1020 — Cloudflare Error 1020: Access Denied (Cloudflare)1020Port 8080 in use — Web server failed to start. Port 8080 was already in use. (Java)Port 8080 in uselisten EACCES — Error: listen EACCES: permission denied 0.0.0.0:80 (Node.js)listen EACCESport 5432 in use — LOG: could not bind IPv4 address "0.0.0.0": Address already in use — Is another postmaster already running on port 5432? (PostgreSQL)port 5432 in useOSError Errno 98 — OSError: [Errno 98] Address already in use (Python)OSError Errno 98CERTIFICATE_VERIFY_FAILED — SSL: CERTIFICATE_VERIFY_FAILED / unable to get local issuer certificate (API)CERTIFICATE_VERIFY_…Git SSL certificate problem — fatal: unable to access 'https://…': SSL certificate problem: unable to get local issuer certificate (Git)Git SSL certificate…PKIX path building failed — javax.net.ssl.SSLHandshakeException: PKIX path building failed: unable to find valid certification path to requested target (Java)PKIX path building …

Directly related (12)

NetworkOnMainThreadExceptionAndroid

android.os.NetworkOnMainThreadException

The app made a network call on the main (UI) thread, which Android forbids.

is an invalid start of a value.NET

System.Text.Json: '<' is an invalid start of a value. Path: $ | LineNumber: 0 | BytePositionInLine: 0

The response wasn’t JSON — usually an HTML error page, login redirect, or an empty body was passed to the JSON deserializer.

DNS in podKubernetes

DNS not working inside a Kubernetes pod (could not resolve host / nslookup: can't resolve)

Pods can’t resolve service names or external hosts — CoreDNS is down, blocked by NetworkPolicy, or the upstream resolver fails.

FailedCreatePodSandBoxKubernetes

Failed to create pod sandbox: plugin type="calico" failed (add): ... (FailedCreatePodSandBox)

The kubelet couldn’t set up the pod’s network sandbox — almost always a CNI plugin problem or exhausted pod IPs.

provided port is not in the valid rangeKubernetes

spec.ports[0].nodePort: Invalid value: 80: provided port is not in the valid range. The range of valid ports is 30000-32767

A NodePort Service asked for a port outside the cluster’s NodePort range (default 30000–32767).

HttpClient.Timeout.NET

TaskCanceledException: The request was canceled due to the configured HttpClient.Timeout of 100 seconds elapsing

The HTTP call took longer than HttpClient.Timeout (100 s default), so .NET cancelled it.

ECONNREFUSEDNode.js

Error: connect ECONNREFUSED 127.0.0.1:5432

Nothing is listening at that host:port — the target service is down or you’re connecting to the wrong address.

CannotPullContainerErrorAWS

ECS task stopped: CannotPullContainerError: pull image manifest has been retried ... / ref pull has been retried

The ECS task couldn’t pull its image — no network route to the registry, missing ECR permissions, or a wrong image tag.

Pool overlapsDocker

Error response from daemon: Pool overlaps with other one on this address space

Docker tried to create a network whose subnet clashes with an existing Docker network (or a VPN/host route).

iptables: No chain/target/matchDocker

driver failed programming external connectivity on endpoint: iptables: No chain/target/match by that name

Docker’s iptables rules were wiped (firewalld/ufw reload, iptables flush) while Docker was running, so it can’t publish ports.

Failed to bind to address.NET

System.IO.IOException: Failed to bind to address http://127.0.0.1:5000: address already in use

Kestrel can’t listen because another process (often a previous run of the same app) uses the port.

The SSL connection could not be established.NET

HttpRequestException: The SSL connection could not be established, see inner exception. (AuthenticationException: The remote certificate is invalid)

HttpClient couldn’t complete the TLS handshake — untrusted/self-signed certificate, name mismatch, expired certificate, or TLS ve…

Two steps away (36)

network not foundDocker

Error response from daemon: network X not found

The container or Compose project refers to a Docker network that doesn’t exist (any more).

default backend - 404Kubernetes

Ingress returns "404 Not Found" / "default backend - 404" (ingress-nginx)

The ingress controller received the request but no Ingress rule matched the host/path, so it answered with its default backend.

no endpointsKubernetes

Service has no endpoints (no endpoints available for service / Endpoints: <none>)

The Service’s selector matches no ready pods, so traffic to it is refused or returns 503.

SyntaxError: JSONJavaScript

SyntaxError: Unexpected token < in JSON at position 0

`JSON.parse()` / `response.json()` received something that isn’t JSON — very often an HTML error page.

MismatchedInputExceptionJava

com.fasterxml.jackson.databind.exc.MismatchedInputException: Cannot deserialize value of type `java.util.ArrayList` from Object value

Jackson found JSON whose shape doesn’t match the target Java type (object vs array, string vs number, missing constructor).

UnrecognizedPropertyExceptionJava

com.fasterxml.jackson.databind.exc.UnrecognizedPropertyException: Unrecognized field "x", not marked as ignorable

The JSON contains a field your Java class doesn’t have, and Jackson is configured to fail on unknown properties.

ENOTFOUNDAPI

Error: getaddrinfo ENOTFOUND host / Name or service not known

DNS lookup for the hostname failed — the name is wrong, doesn’t exist, or this machine can’t resolve it.

ERR_NAME_NOT_RESOLVEDJavaScript

net::ERR_NAME_NOT_RESOLVED (This site can't be reached — server IP address could not be found)

DNS couldn’t resolve the hostname in the browser.

cURL error 6PHP

cURL error 6: Could not resolve host: api.example.com

PHP cURL couldn’t resolve the hostname via DNS.

EvictedKubernetes

Kubernetes: Pod Evicted — The node was low on resource: memory / ephemeral-storage

The kubelet removed the pod because its node ran short of memory or disk.

NotReadyKubernetes

Kubernetes node NotReady (Kubelet stopped posting node status)

The control plane hasn’t heard from a node’s kubelet, or the kubelet reports a problem — pods there stop being scheduled and are…

NSURLErrorDomain Code=-1001iOS

Error Domain=NSURLErrorDomain Code=-1001 "The request timed out."

The server didn’t respond within URLSession’s timeout (60 s default) — slow server, unreachable host on this network, or a stalle…

Job for x.service failedLinux

Job for nginx.service failed because the control process exited with error code

systemd tried to start the service, but its start command failed. The real reason is in the service’s status/journal.

Unit not foundLinux

Failed to start x.service: Unit x.service not found

systemd has no unit with that name — the package isn’t installed, the name differs on this distro, or a new unit file wasn’t load…

Start request repeated too quicklyLinux

systemd: Start request repeated too quickly / service hit its start limit

The service crashed and restarted several times in a short period, so systemd stopped trying (StartLimitBurst).

2006MySQL

MySQL ERROR 2006 (HY000): MySQL server has gone away

The connection to MySQL was closed — usually by a timeout or a packet larger than `max_allowed_packet`.

408HTTP

HTTP 408 Request Timeout

The server closed the connection because the client took too long to send the complete request.

504HTTP

HTTP 504 Gateway Timeout

A proxy or gateway waited too long for the upstream server to respond and gave up.

2002MySQL

MySQL ERROR 2002 (HY000): Can't connect to local MySQL server through socket

The client couldn’t reach the MySQL server — it isn’t running, or the client is looking for the socket/port in the wrong place.

EADDRINUSENode.js

Error: listen EADDRINUSE: address already in use :::3000

Another process is already listening on that port.

Failed to fetchJavaScript

TypeError: Failed to fetch / NetworkError when attempting to fetch resource

The browser couldn’t complete the request at the network level — CORS, DNS, offline, blocked mixed content, or the server refused…

ImagePullBackOffKubernetes

Kubernetes: ImagePullBackOff / ErrImagePull

The node can’t pull the container image — wrong name/tag, missing registry credentials, or registry unreachable.

EROFSnpm

npm ERR! code EROFS — EROFS: read-only file system

npm tried to write to a read-only location (read-only container filesystem, mounted volume, or system path).

ECR token expiredAWS

denied: Your authorization token has expired. Reauthenticate and try again. (Amazon ECR)

Docker’s login to Amazon ECR has expired — ECR tokens last 12 hours, so pushes and pulls fail until you log in again.

compose validationDocker

docker compose: services.x Additional property y is not allowed / yaml: line N: mapping values are not allowed

The compose file is invalid YAML or uses a key Compose doesn’t recognise at that level (usually an indentation mistake).

docker-compose: command not foundDocker

docker-compose: command not found / 'compose' is not a docker command

Your system has only one of the two Compose flavours: the old docker-compose (v1) binary or the newer docker compose (v2) plugin.

depends on undefined serviceDocker

service "web" depends on undefined service "db": invalid compose project

A service lists depends_on (or links/networks) for a service name that isn’t defined in the Compose file(s) being used.

port is already allocatedDocker

Docker: Bind for 0.0.0.0:80 failed: port is already allocated

Another container or host process already publishes that host port.

1020Cloudflare

Cloudflare Error 1020: Access Denied

A Cloudflare firewall/WAF custom rule blocked the request — the visitor’s IP, country, user agent or request pattern matched a bl…

Port 8080 in useJava

Web server failed to start. Port 8080 was already in use.

Spring Boot couldn’t bind its embedded server port because another process uses it.

listen EACCESNode.js

Error: listen EACCES: permission denied 0.0.0.0:80

Node isn’t allowed to bind that port — ports below 1024 need root on Linux/macOS, and some Windows ports are reserved.

port 5432 in usePostgreSQL

LOG: could not bind IPv4 address "0.0.0.0": Address already in use — Is another postmaster already running on port 5432?

Another process (often a second PostgreSQL install or a container) already listens on 5432.

OSError Errno 98Python

OSError: [Errno 98] Address already in use

The port your server wants to bind is already taken by another process.

CERTIFICATE_VERIFY_FAILEDAPI

SSL: CERTIFICATE_VERIFY_FAILED / unable to get local issuer certificate

The client couldn’t verify the server’s TLS certificate chain, so it refused the HTTPS connection.

Git SSL certificate problemGit

fatal: unable to access 'https://…': SSL certificate problem: unable to get local issuer certificate

Git doesn’t trust the HTTPS server’s certificate — corporate proxy, self-hosted Git with an internal CA, or outdated CA bundle.

PKIX path building failedJava

javax.net.ssl.SSLHandshakeException: PKIX path building failed: unable to find valid certification path to requested target

Java doesn’t trust the server’s certificate chain (self-signed, corporate proxy CA, or missing intermediate).