Error map

Config compilation failed CircleCI: Error calling workflow: 'build'. Cannot find a definition for job named test / Config does not conform to schema

CI/CD · layer 7, Build & delivery

Open the full error page →

Centre: this error. First ring: errors it is linked with (10). Outer ring: what those are linked with. Colours show the layer of a request each error belongs to. Click any dot to re-centre the map on it; hover to follow its connections. The centre dot opens the error page.

Config compilation failed — CircleCI: Error calling workflow: 'build'. Cannot find a definition for job named test / Config does not conform to schema (CI/CD)Config comp…compose validation — docker compose: services.x Additional property y is not allowed / yaml: line N: mapping values are not allowed (Docker)compose validationdepends on undefined service — service "web" depends on undefined service "db": invalid compose project (Docker)depends on undefine…the attribute version is obsolete — WARN: the attribute `version` is obsolete, it will be ignored (Docker)the attribute versi…ComparisonError: manifest generation failed — Argo CD: ComparisonError: rpc error: code = Unknown desc = Manifest generation error (cached): kustomize build failed (CI/CD)ComparisonError: ma…Container exceeded memory limit — Bitbucket Pipelines: Container 'Build' exceeded memory limit / Docker container exited with code 137 (CI/CD)Container exceeded …Invalid workflow file — GitHub Actions: Invalid workflow file: .github/workflows/ci.yml#L12 — You have an error in your yaml syntax on line 12 (CI/CD)Invalid workflow fi….gitlab-ci.yml invalid — GitLab CI: Found errors in your .gitlab-ci.yml: jobs:build config contains unknown keys: scripts (CI/CD).gitlab-ci.yml inva…Too long with no output — CircleCI: Too long with no output (exceeded 10m0s): context deadline exceeded (CI/CD)Too long with no ou…Template file not found — Azure Pipelines: /azure-pipelines.yml: File /templates/build.yml not found in repository / Unable to find template (CI/CD)Template file not f…Cannot find orb — CircleCI: Cannot find orb 'circleci/node@9.9.9'. Check the namespace and version exist (CI/CD)Cannot find orbIndentationError — IndentationError: unexpected indent / expected an indented block (Python)IndentationErrorCOPY failed — COPY failed: file not found in build context / "/app/x": not found (Docker)COPY failednetwork not found — Error response from daemon: network X not found (Docker)network not foundPool overlaps — Error response from daemon: Pool overlaps with other one on this address space (Docker)Pool overlapsdocker-compose: command not found — docker-compose: command not found / 'compose' is not a docker command (Docker)docker-compose: com…unhealthy — Docker container is unhealthy (health check failing) (Docker)unhealthyDEP0005 — DeprecationWarning: Buffer() is deprecated due to security and usability issues (DEP0005) (Node.js)DEP0005DEP0040 — DeprecationWarning: The `punycode` module is deprecated (DEP0040) (Node.js)DEP0040npm WARN deprecated — npm WARN deprecated package@1.2.3: This package is no longer supported. (npm)npm WARN deprecatedImagePullBackOff — Kubernetes: ImagePullBackOff / ErrImagePull (Kubernetes)ImagePullBackOfferror parsing called workflow — GitHub Actions: error parsing called workflow ".github/workflows/ci.yml" -> "org/repo/.github/workflows/build.yml@main": workflow was not found (CI/CD)error parsing calle…Scripts not permitted to use method — Jenkins: org.jenkinsci.plugins.scriptsecurity.sandbox.RejectedAccessException: Scripts not permitted to use method java.lang.String toUpperCase (CI/CD)Scripts not permitt…Process completed with exit code 137 — GitHub Actions: Error: Process completed with exit code 137 (Killed — out of memory) (CI/CD)Process completed w…Cannot connect to the Docker daemon (GitLab) — GitLab CI: Cannot connect to the Docker daemon at tcp://docker:2375. Is the docker daemon running? (CI/CD)Cannot connect to t…Waiting for next available executor — Jenkins: Still waiting to schedule task — Waiting for next available executor / 'agent1' is offline (CI/CD)Waiting for next av…Unrecognized named-value — GitHub Actions: Unrecognized named-value: 'secrets'. Located at position 1 within expression: secrets.API_KEY (CI/CD)Unrecognized named-…workflow not triggering — GitHub Actions: workflow does not run on push / pull_request / workflow_dispatch button missing (CI/CD)workflow not trigge…Unable to process file command — GitHub Actions: Error: Unable to process file command 'output' successfully. Invalid format 'x' (CI/CD)Unable to process f…Uploading artifacts: too large archive — GitLab CI: ERROR: Uploading artifacts as "archive" to coordinator... too large archive id=123 responseStatus=413 Request Entity Too Large (CI/CD)Uploading artifacts…Job depends on artifacts that have expired — GitLab CI: This job could not start because it could not retrieve the needed artifacts (dependencies: build). (CI/CD)Job depends on arti…Pipeline filtered out by workflow:rules — GitLab CI: No pipeline created — pipeline filtered out by workflow:rules / "The rules configuration prevented any jobs from being added to the pipeline" (CI/CD)Pipeline filtered o…exceeded the maximum execution time — GitHub Actions: The job running on runner GitHub Actions 12 has exceeded the maximum execution time of 360 minutes (CI/CD)exceeded the maximu…execution took longer than 1h0m0s — GitLab CI: ERROR: Job failed: execution took longer than 1h0m0s seconds (CI/CD)execution took long…service connection could not be found — Azure Pipelines: There was a resource authorization issue: The pipeline is not valid. Could not find a service connection with identifier x (Azure)service connection …No such DSL method — Jenkins: java.lang.NoSuchMethodError: No such DSL method 'dockerBuild' found among steps (CI/CD)No such DSL methodAPI rate limit exceeded — GitHub Actions: HttpError: API rate limit exceeded for installation ID 123456 / secondary rate limit (CI/CD)API rate limit exce…

Directly related (10)

compose validationDocker

docker compose: services.x Additional property y is not allowed / yaml: line N: mapping values are not allowed

The compose file is invalid YAML or uses a key Compose doesn’t recognise at that level (usually an indentation mistake).

depends on undefined serviceDocker

service "web" depends on undefined service "db": invalid compose project

A service lists depends_on (or links/networks) for a service name that isn’t defined in the Compose file(s) being used.

the attribute version is obsoleteDocker

WARN: the attribute `version` is obsolete, it will be ignored

A harmless Compose v2 warning: the top-level version: line in docker-compose.yml is no longer used.

ComparisonError: manifest generation failedCI/CD

Argo CD: ComparisonError: rpc error: code = Unknown desc = Manifest generation error (cached): kustomize build failed

Argo CD could not render the manifests (Helm, Kustomize or plain YAML) for the application, so it cannot compare Git with the clu…

Container exceeded memory limitCI/CD

Bitbucket Pipelines: Container 'Build' exceeded memory limit / Docker container exited with code 137

A Bitbucket Pipelines step used more memory than the step allows (4 GB by default, 1 GB for service containers) and was killed.

Invalid workflow fileCI/CD

GitHub Actions: Invalid workflow file: .github/workflows/ci.yml#L12 — You have an error in your yaml syntax on line 12

GitHub could not parse your workflow YAML, so no run was created — usually indentation, a tab, or an unquoted special character.

.gitlab-ci.yml invalidCI/CD

GitLab CI: Found errors in your .gitlab-ci.yml: jobs:build config contains unknown keys: scripts

GitLab rejected the pipeline configuration, so no pipeline was created — the message names the job and the problem.

Too long with no outputCI/CD

CircleCI: Too long with no output (exceeded 10m0s): context deadline exceeded

A CircleCI step printed nothing for 10 minutes, so CircleCI assumed it hung and cancelled it.

Template file not foundCI/CD

Azure Pipelines: /azure-pipelines.yml: File /templates/build.yml not found in repository / Unable to find template

The YAML references a template (`template: templates/build.yml`) that Azure cannot find — wrong path, repo resource or branch.

Cannot find orbCI/CD

CircleCI: Cannot find orb 'circleci/node@9.9.9'. Check the namespace and version exist

The orb reference in your config does not resolve: wrong namespace, name or version, or the orb is private and not accessible.

Two steps away (26)

IndentationErrorPython

IndentationError: unexpected indent / expected an indented block

Python’s block structure is broken — inconsistent indentation or mixed tabs and spaces.

COPY failedDocker

COPY failed: file not found in build context / "/app/x": not found

The Dockerfile COPY refers to a path outside the build context, excluded by .dockerignore, or relative to the wrong directory.

network not foundDocker

Error response from daemon: network X not found

The container or Compose project refers to a Docker network that doesn’t exist (any more).

Pool overlapsDocker

Error response from daemon: Pool overlaps with other one on this address space

Docker tried to create a network whose subnet clashes with an existing Docker network (or a VPN/host route).

docker-compose: command not foundDocker

docker-compose: command not found / 'compose' is not a docker command

Your system has only one of the two Compose flavours: the old docker-compose (v1) binary or the newer docker compose (v2) plugin.

unhealthyDocker

Docker container is unhealthy (health check failing)

The container is running, but its HEALTHCHECK command keeps failing, so Docker (and dependent services) consider it unhealthy.

DEP0005Node.js

DeprecationWarning: Buffer() is deprecated due to security and usability issues (DEP0005)

Code (yours or a dependency) uses the deprecated new Buffer() constructor.

DEP0040Node.js

DeprecationWarning: The `punycode` module is deprecated (DEP0040)

A dependency imports Node’s built-in punycode module, deprecated since Node 21.

npm WARN deprecatednpm

npm WARN deprecated package@1.2.3: This package is no longer supported.

A dependency (often a transitive one) is deprecated by its author.

ImagePullBackOffKubernetes

Kubernetes: ImagePullBackOff / ErrImagePull

The node can’t pull the container image — wrong name/tag, missing registry credentials, or registry unreachable.

error parsing called workflowCI/CD

GitHub Actions: error parsing called workflow ".github/workflows/ci.yml" -> "org/repo/.github/workflows/build.yml@main": workflow was not found

A job calls a reusable workflow (`uses: org/repo/.github/workflows/x.yml@ref`) that GitHub cannot find or is not allowed to use.

Scripts not permitted to use methodCI/CD

Jenkins: org.jenkinsci.plugins.scriptsecurity.sandbox.RejectedAccessException: Scripts not permitted to use method java.lang.String toUpperCase

A sandboxed Pipeline script called a method that has not been approved in Script Security.

Process completed with exit code 137CI/CD

GitHub Actions: Error: Process completed with exit code 137 (Killed — out of memory)

The command was killed by the system with SIGKILL (128 + 9), almost always because the runner ran out of memory.

Cannot connect to the Docker daemon (GitLab)CI/CD

GitLab CI: Cannot connect to the Docker daemon at tcp://docker:2375. Is the docker daemon running?

A docker-in-docker job could not reach the `docker:dind` service — it is not started, not privileged, or the TLS/host settings do…

Waiting for next available executorCI/CD

Jenkins: Still waiting to schedule task — Waiting for next available executor / 'agent1' is offline

A Jenkins build is queued because no executor with the required label is free or the agent is offline.

Unrecognized named-valueCI/CD

GitHub Actions: Unrecognized named-value: 'secrets'. Located at position 1 within expression: secrets.API_KEY

You used an expression context (`secrets`, `env`, `matrix`, `steps`…) in a place of the workflow where that context is not availa…

workflow not triggeringCI/CD

GitHub Actions: workflow does not run on push / pull_request / workflow_dispatch button missing

A workflow file exists but no run appears — the trigger filters do not match, the file is not on the right branch, or the workflo…

Unable to process file commandCI/CD

GitHub Actions: Error: Unable to process file command 'output' successfully. Invalid format 'x'

A line written to `$GITHUB_OUTPUT`, `$GITHUB_ENV` or `$GITHUB_STATE` is not in `name=value` form — usually a multi-line value wit…

Uploading artifacts: too large archiveCI/CD

GitLab CI: ERROR: Uploading artifacts as "archive" to coordinator... too large archive id=123 responseStatus=413 Request Entity Too Large

The job produced an artifact bigger than the instance or project's maximum artifact size.

Job depends on artifacts that have expiredCI/CD

GitLab CI: This job could not start because it could not retrieve the needed artifacts (dependencies: build).

A job needs artifacts from an earlier job, but that job failed, was skipped or its artifacts have expired or been deleted.

Pipeline filtered out by workflow:rulesCI/CD

GitLab CI: No pipeline created — pipeline filtered out by workflow:rules / "The rules configuration prevented any jobs from being added to the pipeline"

Your `workflow:rules` or job-level `rules:` evaluated to "never" for this event, so GitLab created no pipeline or no jobs.

exceeded the maximum execution timeCI/CD

GitHub Actions: The job running on runner GitHub Actions 12 has exceeded the maximum execution time of 360 minutes

A job ran longer than its time limit — your `timeout-minutes`, or the 6-hour (360 minute) platform limit — and was cancelled.

execution took longer than 1h0m0sCI/CD

GitLab CI: ERROR: Job failed: execution took longer than 1h0m0s seconds

The job ran past its timeout (project default is 60 minutes) and GitLab killed it.

service connection could not be foundAzure

Azure Pipelines: There was a resource authorization issue: The pipeline is not valid. Could not find a service connection with identifier x

The pipeline references a service connection that doesn’t exist in the project or isn’t authorized for this pipeline.

No such DSL methodCI/CD

Jenkins: java.lang.NoSuchMethodError: No such DSL method 'dockerBuild' found among steps

The Jenkinsfile calls a step that does not exist — the plugin is not installed, or the name or argument is wrong.

API rate limit exceededCI/CD

GitHub Actions: HttpError: API rate limit exceeded for installation ID 123456 / secondary rate limit

Your workflow (or an action it uses) made too many GitHub API calls and was throttled with 403/429.