Error map

Waiting for next available executor Jenkins: Still waiting to schedule task — Waiting for next available executor / 'agent1' is offline

CI/CD · layer 7, Build & delivery

Open the full error page →

Centre: this error. First ring: errors it is linked with (8). Outer ring: what those are linked with. Colours show the layer of a request each error belongs to. Click any dot to re-centre the map on it; hover to follow its connections. The centre dot opens the error page.

Waiting for next available executor — Jenkins: Still waiting to schedule task — Waiting for next available executor / 'agent1' is offline (CI/CD)Waiting for…This job is stuck because you don't have any active runners — GitLab CI: This job is stuck because you don't have any active runners online or available with any of these tags assigned to them (CI/CD)This job is stuck b…permission denied /var/run/docker.sock — Jenkins: Got permission denied while trying to connect to the Docker daemon socket at unix:///var/run/docker.sock (CI/CD)permission denied /…Container exceeded memory limit — Bitbucket Pipelines: Container 'Build' exceeded memory limit / Docker container exited with code 137 (CI/CD)Container exceeded …Scripts not permitted to use method — Jenkins: org.jenkinsci.plugins.scriptsecurity.sandbox.RejectedAccessException: Scripts not permitted to use method java.lang.String toUpperCase (CI/CD)Scripts not permitt…WorkflowScript compilation error — Jenkins: WorkflowScript: 12: unexpected token: } @ line 12, column 5. 1 error (CI/CD)WorkflowScript comp…Could not find credentials entry — Jenkins: ERROR: Could not find credentials entry with ID 'github-token' (CI/CD)Could not find cred…Waiting for a runner to pick up this job — GitHub Actions: Waiting for a runner to pick up this job… (job stays queued — No runner matching the specified labels) (CI/CD)Waiting for a runne…No such DSL method — Jenkins: java.lang.NoSuchMethodError: No such DSL method 'dockerBuild' found among steps (CI/CD)No such DSL methodNo hosted parallelism — Azure Pipelines: No hosted parallelism has been purchased or granted (Azure)No hosted paralleli…Resource not accessible by integration — GitHub Actions: Error: Resource not accessible by integration (403) (CI/CD)Resource not access…The process '/usr/bin/git' failed with exit code 128 — GitHub Actions: Error: The process '/usr/bin/git' failed with exit code 128 (CI/CD)The process '/usr/b…daemon — Cannot connect to the Docker daemon at unix:///var/run/docker.sock. Is the docker daemon running? (Docker)daemonCannot perform an interactive login from a non TTY device — GitHub Actions: Error: Cannot perform an interactive login from a non TTY device (CI/CD)Cannot perform an i…Cannot connect to the Docker daemon (GitLab) — GitLab CI: Cannot connect to the Docker daemon at tcp://docker:2375. Is the docker daemon running? (CI/CD)Cannot connect to t…Process completed with exit code 137 — GitHub Actions: Error: Process completed with exit code 137 (Killed — out of memory) (CI/CD)Process completed w…Too long with no output — CircleCI: Too long with no output (exceeded 10m0s): context deadline exceeded (CI/CD)Too long with no ou…Config compilation failed — CircleCI: Error calling workflow: 'build'. Cannot find a definition for job named test / Config does not conform to schema (CI/CD)Config compilation …Template file not found — Azure Pipelines: /azure-pipelines.yml: File /templates/build.yml not found in repository / Unable to find template (CI/CD)Template file not f…ComparisonError: manifest generation failed — Argo CD: ComparisonError: rpc error: code = Unknown desc = Manifest generation error (cached): kustomize build failed (CI/CD)ComparisonError: ma…Invalid workflow file — GitHub Actions: Invalid workflow file: .github/workflows/ci.yml#L12 — You have an error in your yaml syntax on line 12 (CI/CD)Invalid workflow fi…Input required and not supplied — GitHub Actions: Error: Input required and not supplied: token (CI/CD)Input required and …workflow not triggering — GitHub Actions: workflow does not run on push / pull_request / workflow_dispatch button missing (CI/CD)workflow not trigge…The runner has received a shutdown signal — GitHub Actions: The runner has received a shutdown signal. This can happen when the runner service is stopped, or a manually started runner is canceled (CI/CD)The runner has rece…No space left on device (runner) — GitHub Actions: System.IO.IOException: No space left on device — the runner's disk is full (CI/CD)No space left on de…

Directly related (8)

This job is stuck because you don't have any active runnersCI/CD

GitLab CI: This job is stuck because you don't have any active runners online or available with any of these tags assigned to them

No GitLab runner can pick up the job — runners are offline, the job’s tags don’t match any runner, or shared runners are disabled.

permission denied /var/run/docker.sockCI/CD

Jenkins: Got permission denied while trying to connect to the Docker daemon socket at unix:///var/run/docker.sock

The Jenkins user is not allowed to talk to Docker — it is not in the `docker` group or the socket is not mounted in the container.

Container exceeded memory limitCI/CD

Bitbucket Pipelines: Container 'Build' exceeded memory limit / Docker container exited with code 137

A Bitbucket Pipelines step used more memory than the step allows (4 GB by default, 1 GB for service containers) and was killed.

Scripts not permitted to use methodCI/CD

Jenkins: org.jenkinsci.plugins.scriptsecurity.sandbox.RejectedAccessException: Scripts not permitted to use method java.lang.String toUpperCase

A sandboxed Pipeline script called a method that has not been approved in Script Security.

WorkflowScript compilation errorCI/CD

Jenkins: WorkflowScript: 12: unexpected token: } @ line 12, column 5. 1 error

The Jenkinsfile has a Groovy/Declarative syntax error, so the build fails before running any stage.

Could not find credentials entryCI/CD

Jenkins: ERROR: Could not find credentials entry with ID 'github-token'

The Jenkinsfile references a credentials ID that does not exist in the scope Jenkins can see for this job.

Waiting for a runner to pick up this jobCI/CD

GitHub Actions: Waiting for a runner to pick up this job… (job stays queued — No runner matching the specified labels)

The job is queued and never starts — no available runner has all the labels in `runs-on`, runners are offline/busy, or the hosted…

No such DSL methodCI/CD

Jenkins: java.lang.NoSuchMethodError: No such DSL method 'dockerBuild' found among steps

The Jenkinsfile calls a step that does not exist — the plugin is not installed, or the name or argument is wrong.

Two steps away (16)

No hosted parallelismAzure

Azure Pipelines: No hosted parallelism has been purchased or granted

The Azure DevOps organization has no Microsoft-hosted parallel jobs, so pipelines can’t run on hosted agents.

Resource not accessible by integrationCI/CD

GitHub Actions: Error: Resource not accessible by integration (403)

The workflow’s GITHUB_TOKEN doesn’t have the permission needed for that API call (comment, push, create release, write packages).

The process '/usr/bin/git' failed with exit code 128CI/CD

GitHub Actions: Error: The process '/usr/bin/git' failed with exit code 128

A git command inside the workflow failed — usually authentication to a private repo/submodule, a missing ref, or pushing without…

daemonDocker

Cannot connect to the Docker daemon at unix:///var/run/docker.sock. Is the docker daemon running?

The docker CLI can’t talk to the Docker engine — it isn’t running, or your user can’t access the socket.

Cannot perform an interactive login from a non TTY deviceCI/CD

GitHub Actions: Error: Cannot perform an interactive login from a non TTY device

`docker login` asked for a password interactively, but CI has no terminal — pass credentials non-interactively.

Cannot connect to the Docker daemon (GitLab)CI/CD

GitLab CI: Cannot connect to the Docker daemon at tcp://docker:2375. Is the docker daemon running?

A docker-in-docker job could not reach the `docker:dind` service — it is not started, not privileged, or the TLS/host settings do…

Process completed with exit code 137CI/CD

GitHub Actions: Error: Process completed with exit code 137 (Killed — out of memory)

The command was killed by the system with SIGKILL (128 + 9), almost always because the runner ran out of memory.

Too long with no outputCI/CD

CircleCI: Too long with no output (exceeded 10m0s): context deadline exceeded

A CircleCI step printed nothing for 10 minutes, so CircleCI assumed it hung and cancelled it.

Config compilation failedCI/CD

CircleCI: Error calling workflow: 'build'. Cannot find a definition for job named test / Config does not conform to schema

CircleCI could not compile `.circleci/config.yml` — a workflow refers to a missing job, a key is invalid, or the YAML is malforme…

Template file not foundCI/CD

Azure Pipelines: /azure-pipelines.yml: File /templates/build.yml not found in repository / Unable to find template

The YAML references a template (`template: templates/build.yml`) that Azure cannot find — wrong path, repo resource or branch.

ComparisonError: manifest generation failedCI/CD

Argo CD: ComparisonError: rpc error: code = Unknown desc = Manifest generation error (cached): kustomize build failed

Argo CD could not render the manifests (Helm, Kustomize or plain YAML) for the application, so it cannot compare Git with the clu…

Invalid workflow fileCI/CD

GitHub Actions: Invalid workflow file: .github/workflows/ci.yml#L12 — You have an error in your yaml syntax on line 12

GitHub could not parse your workflow YAML, so no run was created — usually indentation, a tab, or an unquoted special character.

Input required and not suppliedCI/CD

GitHub Actions: Error: Input required and not supplied: token

An action needs an input (token, ssh-key, api-key…) and the `with:` value is empty or missing — often because the secret does not…

workflow not triggeringCI/CD

GitHub Actions: workflow does not run on push / pull_request / workflow_dispatch button missing

A workflow file exists but no run appears — the trigger filters do not match, the file is not on the right branch, or the workflo…

The runner has received a shutdown signalCI/CD

GitHub Actions: The runner has received a shutdown signal. This can happen when the runner service is stopped, or a manually started runner is canceled

The machine running your job was shut down or reclaimed while the job was running — a self-hosted runner stopped, a spot instance…

No space left on device (runner)CI/CD

GitHub Actions: System.IO.IOException: No space left on device — the runner's disk is full

The job filled the runner's disk (about 14 GB free on standard Linux runners): large Docker images, caches, build outputs or test…