Error map

WorkflowScript compilation error Jenkins: WorkflowScript: 12: unexpected token: } @ line 12, column 5. 1 error

CI/CD · layer 7, Build & delivery

Open the full error page →

Centre: this error. First ring: errors it is linked with (7). Outer ring: what those are linked with. Colours show the layer of a request each error belongs to. Click any dot to re-centre the map on it; hover to follow its connections. The centre dot opens the error page.

WorkflowScript compilation error — Jenkins: WorkflowScript: 12: unexpected token: } @ line 12, column 5. 1 error (CI/CD)WorkflowScr…Waiting for next available executor — Jenkins: Still waiting to schedule task — Waiting for next available executor / 'agent1' is offline (CI/CD)Waiting for next av…permission denied /var/run/docker.sock — Jenkins: Got permission denied while trying to connect to the Docker daemon socket at unix:///var/run/docker.sock (CI/CD)permission denied /…ComparisonError: manifest generation failed — Argo CD: ComparisonError: rpc error: code = Unknown desc = Manifest generation error (cached): kustomize build failed (CI/CD)ComparisonError: ma…Invalid workflow file — GitHub Actions: Invalid workflow file: .github/workflows/ci.yml#L12 — You have an error in your yaml syntax on line 12 (CI/CD)Invalid workflow fi…Scripts not permitted to use method — Jenkins: org.jenkinsci.plugins.scriptsecurity.sandbox.RejectedAccessException: Scripts not permitted to use method java.lang.String toUpperCase (CI/CD)Scripts not permitt…Could not find credentials entry — Jenkins: ERROR: Could not find credentials entry with ID 'github-token' (CI/CD)Could not find cred…No such DSL method — Jenkins: java.lang.NoSuchMethodError: No such DSL method 'dockerBuild' found among steps (CI/CD)No such DSL methodThis job is stuck because you don't have any active runners — GitLab CI: This job is stuck because you don't have any active runners online or available with any of these tags assigned to them (CI/CD)This job is stuck b…Waiting for a runner to pick up this job — GitHub Actions: Waiting for a runner to pick up this job… (job stays queued — No runner matching the specified labels) (CI/CD)Waiting for a runne…Container exceeded memory limit — Bitbucket Pipelines: Container 'Build' exceeded memory limit / Docker container exited with code 137 (CI/CD)Container exceeded …daemon — Cannot connect to the Docker daemon at unix:///var/run/docker.sock. Is the docker daemon running? (Docker)daemonCannot perform an interactive login from a non TTY device — GitHub Actions: Error: Cannot perform an interactive login from a non TTY device (CI/CD)Cannot perform an i…Cannot connect to the Docker daemon (GitLab) — GitLab CI: Cannot connect to the Docker daemon at tcp://docker:2375. Is the docker daemon running? (CI/CD)Cannot connect to t…ImagePullBackOff — Kubernetes: ImagePullBackOff / ErrImagePull (Kubernetes)ImagePullBackOfferror parsing called workflow — GitHub Actions: error parsing called workflow ".github/workflows/ci.yml" -> "org/repo/.github/workflows/build.yml@main": workflow was not found (CI/CD)error parsing calle…Too long with no output — CircleCI: Too long with no output (exceeded 10m0s): context deadline exceeded (CI/CD)Too long with no ou…Unrecognized named-value — GitHub Actions: Unrecognized named-value: 'secrets'. Located at position 1 within expression: secrets.API_KEY (CI/CD)Unrecognized named-…workflow not triggering — GitHub Actions: workflow does not run on push / pull_request / workflow_dispatch button missing (CI/CD)workflow not trigge…Unable to process file command — GitHub Actions: Error: Unable to process file command 'output' successfully. Invalid format 'x' (CI/CD)Unable to process f…Template file not found — Azure Pipelines: /azure-pipelines.yml: File /templates/build.yml not found in repository / Unable to find template (CI/CD)Template file not f…Input required and not supplied — GitHub Actions: Error: Input required and not supplied: token (CI/CD)Input required and …

Directly related (7)

Waiting for next available executorCI/CD

Jenkins: Still waiting to schedule task — Waiting for next available executor / 'agent1' is offline

A Jenkins build is queued because no executor with the required label is free or the agent is offline.

permission denied /var/run/docker.sockCI/CD

Jenkins: Got permission denied while trying to connect to the Docker daemon socket at unix:///var/run/docker.sock

The Jenkins user is not allowed to talk to Docker — it is not in the `docker` group or the socket is not mounted in the container.

ComparisonError: manifest generation failedCI/CD

Argo CD: ComparisonError: rpc error: code = Unknown desc = Manifest generation error (cached): kustomize build failed

Argo CD could not render the manifests (Helm, Kustomize or plain YAML) for the application, so it cannot compare Git with the clu…

Invalid workflow fileCI/CD

GitHub Actions: Invalid workflow file: .github/workflows/ci.yml#L12 — You have an error in your yaml syntax on line 12

GitHub could not parse your workflow YAML, so no run was created — usually indentation, a tab, or an unquoted special character.

Scripts not permitted to use methodCI/CD

Jenkins: org.jenkinsci.plugins.scriptsecurity.sandbox.RejectedAccessException: Scripts not permitted to use method java.lang.String toUpperCase

A sandboxed Pipeline script called a method that has not been approved in Script Security.

Could not find credentials entryCI/CD

Jenkins: ERROR: Could not find credentials entry with ID 'github-token'

The Jenkinsfile references a credentials ID that does not exist in the scope Jenkins can see for this job.

No such DSL methodCI/CD

Jenkins: java.lang.NoSuchMethodError: No such DSL method 'dockerBuild' found among steps

The Jenkinsfile calls a step that does not exist — the plugin is not installed, or the name or argument is wrong.

Two steps away (14)

This job is stuck because you don't have any active runnersCI/CD

GitLab CI: This job is stuck because you don't have any active runners online or available with any of these tags assigned to them

No GitLab runner can pick up the job — runners are offline, the job’s tags don’t match any runner, or shared runners are disabled.

Waiting for a runner to pick up this jobCI/CD

GitHub Actions: Waiting for a runner to pick up this job… (job stays queued — No runner matching the specified labels)

The job is queued and never starts — no available runner has all the labels in `runs-on`, runners are offline/busy, or the hosted…

Container exceeded memory limitCI/CD

Bitbucket Pipelines: Container 'Build' exceeded memory limit / Docker container exited with code 137

A Bitbucket Pipelines step used more memory than the step allows (4 GB by default, 1 GB for service containers) and was killed.

daemonDocker

Cannot connect to the Docker daemon at unix:///var/run/docker.sock. Is the docker daemon running?

The docker CLI can’t talk to the Docker engine — it isn’t running, or your user can’t access the socket.

Cannot perform an interactive login from a non TTY deviceCI/CD

GitHub Actions: Error: Cannot perform an interactive login from a non TTY device

`docker login` asked for a password interactively, but CI has no terminal — pass credentials non-interactively.

Cannot connect to the Docker daemon (GitLab)CI/CD

GitLab CI: Cannot connect to the Docker daemon at tcp://docker:2375. Is the docker daemon running?

A docker-in-docker job could not reach the `docker:dind` service — it is not started, not privileged, or the TLS/host settings do…

ImagePullBackOffKubernetes

Kubernetes: ImagePullBackOff / ErrImagePull

The node can’t pull the container image — wrong name/tag, missing registry credentials, or registry unreachable.

error parsing called workflowCI/CD

GitHub Actions: error parsing called workflow ".github/workflows/ci.yml" -> "org/repo/.github/workflows/build.yml@main": workflow was not found

A job calls a reusable workflow (`uses: org/repo/.github/workflows/x.yml@ref`) that GitHub cannot find or is not allowed to use.

Too long with no outputCI/CD

CircleCI: Too long with no output (exceeded 10m0s): context deadline exceeded

A CircleCI step printed nothing for 10 minutes, so CircleCI assumed it hung and cancelled it.

Unrecognized named-valueCI/CD

GitHub Actions: Unrecognized named-value: 'secrets'. Located at position 1 within expression: secrets.API_KEY

You used an expression context (`secrets`, `env`, `matrix`, `steps`…) in a place of the workflow where that context is not availa…

workflow not triggeringCI/CD

GitHub Actions: workflow does not run on push / pull_request / workflow_dispatch button missing

A workflow file exists but no run appears — the trigger filters do not match, the file is not on the right branch, or the workflo…

Unable to process file commandCI/CD

GitHub Actions: Error: Unable to process file command 'output' successfully. Invalid format 'x'

A line written to `$GITHUB_OUTPUT`, `$GITHUB_ENV` or `$GITHUB_STATE` is not in `name=value` form — usually a multi-line value wit…

Template file not foundCI/CD

Azure Pipelines: /azure-pipelines.yml: File /templates/build.yml not found in repository / Unable to find template

The YAML references a template (`template: templates/build.yml`) that Azure cannot find — wrong path, repo resource or branch.

Input required and not suppliedCI/CD

GitHub Actions: Error: Input required and not supplied: token

An action needs an input (token, ssh-key, api-key…) and the `with:` value is empty or missing — often because the secret does not…