Error map
permission denied (volume) Permission denied writing to a mounted volume inside a Docker container
Docker · layer 6, Platform & cloud
Centre: this error. First ring: errors it is linked with (12). Outer ring: what those are linked with. Colours show the layer of a request each error belongs to. Click any dot to re-centre the map on it; hover to follow its connections. The centre dot opens the error page.
Directly related (12)
Linux: Permission denied
Your user (or the service user) lacks read/write/execute permission on a file, directory or one of its parents.
Windows Error 0x80070005 (E_ACCESSDENIED): Access is denied
Windows refused an operation because the account or process lacks permission — seen in Windows Update, installers, Task Scheduler…
sqlite3.OperationalError: attempt to write a readonly database
The process can’t write to the SQLite file or its directory.
macOS: Operation not permitted — Terminal/app lacks Full Disk Access (TCC privacy protection)
macOS privacy protection (TCC) blocked access to protected folders (Desktop, Documents, Downloads, Mail, Photos, external volumes…
Cannot connect to the Docker daemon at unix:///var/run/docker.sock. Is the docker daemon running?
The docker CLI can’t talk to the Docker engine — it isn’t running, or your user can’t access the socket.
Warning: session_start(): open(/var/lib/php/sessions/sess_x, O_RDWR) failed: Permission denied
PHP can’t write session files to the configured session.save_path.
OAuth 2.0 Error: invalid_scope / insufficient_scope
The requested scope is unknown or not allowed for this client — or the token lacks the scope the API endpoint requires.
java.nio.file.AccessDeniedException: /path
The OS denied a file operation to the Java process.
System.UnauthorizedAccessException: Access to the path 'x' is denied
The process’s identity can’t read/write that file or folder — IIS app pool identity, container user, read-only attribute, or a di…
NotAllowedError: Failed to execute 'writeText' on 'Clipboard': Document is not focused.
The Clipboard API refused to write — the page isn’t focused, there was no user gesture, or the context isn’t secure.
SELinux is preventing ... / avc: denied { read } for pid=... (permission denied despite correct permissions)
SELinux blocked the access — file permissions look fine, but the file’s security context or a boolean doesn’t allow the service t…
Key Vault: (Forbidden) The user, group or application does not have secrets get permission on key vault
The caller authenticated but has no permission on the vault — missing access policy or RBAC role, or the vault’s firewall blocks…
Two steps away (36)
Git: Permission denied (publickey). fatal: Could not read from remote repository.
SSH authentication to GitHub/GitLab/Bitbucket failed — no key, wrong key, or the key isn’t added to your account.
npm ERR! code EACCES — permission denied
npm can’t write to a directory — usually global installs into a root-owned folder.
no space left on device (Docker / Linux)
The disk (or inode table) is full — Docker images, build cache, logs and volumes are common culprits.
HTTP 403 Forbidden
The server understood the request but refuses to authorize it — you (or the server process) are not allowed to access this resour…
Windows Error 0x80070002: The system cannot find the file specified
A file or registry entry Windows expected is missing — common in Windows Update, backups and app installs.
Windows Error 0x80004005 (E_FAIL): Unspecified error
A generic failure code — the operation failed for a reason the component didn’t report precisely. Context decides the fix.
sqlite3.OperationalError: database is locked (SQLITE_BUSY)
Another connection holds a write lock on the SQLite file, and this one gave up waiting.
sqlite3.OperationalError: no such column: x
SQLite can’t find the column — missing migration, typo, or a string written in double quotes.
sqlite3.IntegrityError: UNIQUE constraint failed: users.email
An insert/update duplicated a value in a UNIQUE or PRIMARY KEY column in SQLite.
user is not in the sudoers file. This incident will be reported.
Your account isn’t allowed to use sudo.
WordPress: Sorry, you are not allowed to access this page.
Your user role lacks the capability for that admin screen — or the database table prefix / user capabilities are out of sync afte…
Error: listen EACCES: permission denied 0.0.0.0:80
Node isn’t allowed to bind that port — ports below 1024 need root on Linux/macOS, and some Windows ports are reserved.
MySQL ERROR 2002 (HY000): Can't connect to local MySQL server through socket
The client couldn’t reach the MySQL server — it isn’t running, or the client is looking for the socket/port in the wrong place.
Docker: Bind for 0.0.0.0:80 failed: port is already allocated
Another container or host process already publishes that host port.
Error: getaddrinfo ENOTFOUND host / Name or service not known
DNS lookup for the hostname failed — the name is wrong, doesn’t exist, or this machine can’t resolve it.
AWS: ExpiredToken — The security token included in the request is expired
Temporary AWS credentials (STS/SSO/assumed role) have expired.
HTTP 401 Unauthorized
The request has no valid authentication credentials — you need to log in or send a valid token.
Warning: session_start(): Session cannot be started after headers have already been sent
session_start() ran after output was sent, so PHP can’t set the session cookie.
OAuth 2.0 Error: invalid_grant
The authorization code, refresh token or credentials sent to the token endpoint are invalid, expired, already used or were issued…
OAuth 2.0 Error: invalid_client
The OAuth server couldn’t authenticate your application — wrong client ID/secret, wrong auth method, or the client doesn’t exist…
npm update check failed — Try running with sudo or get access to the local update config store
npm’s update notifier couldn’t write its config — usually root-owned files in ~/.config from a past sudo npm.
java.lang.StringIndexOutOfBoundsException: begin 0, end 10, length 5
substring()/charAt() used an index outside the string.
java.lang.ArithmeticException: / by zero
Integer division or modulo by zero.
java.lang.UnsupportedOperationException (List.of / Arrays.asList is immutable)
Code tried to modify an immutable or fixed-size collection.
Error: ENOENT: no such file or directory
A file or directory the program tried to open doesn’t exist at that path.
java.io.FileNotFoundException: config.properties (No such file or directory)
Java couldn’t open the file — wrong path relative to the working directory, missing file, or a classpath resource read as a file.
java.nio.file.NoSuchFileException: /path/file
An NIO Files operation targeted a path that doesn’t exist.
net::ERR_BLOCKED_BY_CLIENT
A browser extension (ad blocker, privacy tool) blocked the request.
net::ERR_CONNECTION_REFUSED (This site can't be reached — refused to connect)
The browser reached the host but nothing was listening on that port.
net::ERR_NAME_NOT_RESOLVED (This site can't be reached — server IP address could not be found)
DNS couldn’t resolve the hostname in the browser.
Webhook signature verification failed (Stripe, Razorpay, GitHub…)
Your endpoint computed a different HMAC signature than the one the provider sent, so the webhook is rejected.
WARNING: REMOTE HOST IDENTIFICATION HAS CHANGED! (ssh host key changed)
The server’s SSH host key differs from the one saved in ~/.ssh/known_hosts — usually because the server was rebuilt or the IP was…
WARNING: UNPROTECTED PRIVATE KEY FILE! Permissions 0644 for 'key.pem' are too open
SSH refuses to use a private key that other users can read; it must be readable only by you (chmod 600).
Azure: AuthorizationFailed — The client does not have authorization to perform action
The signed-in identity (user, service principal or managed identity) lacks an Azure RBAC role for that action on that scope.
Error: EPERM: operation not permitted, rename / unlink
The OS refused a file operation — on Windows usually because another process (antivirus, editor, indexer) has the file locked.
Error: spawn EACCES
Node tried to execute a file that isn’t executable (missing +x permission) or isn’t a program.
Map another error
Popular: 4035004000xC000007BTypeErrorCritical error404NullPointerException