Error map

NG02100 Angular: NG02100: InvalidPipeArgument: 'Unable to convert "x" into a date' for pipe 'DatePipe'

Angular Β· layer 1, On your device

Open the full error page β†’

Centre: this error. First ring: errors it is linked with (7). Outer ring: what those are linked with. Colours show the layer of a request each error belongs to. Click any dot to re-centre the map on it; hover to follow its connections. The centre dot opens the error page.

NG02100 β€” Angular: NG02100: InvalidPipeArgument: 'Unable to convert "x" into a date' for pipe 'DatePipe' (Angular)NG02100TS2322 β€” TS2322: Type 'X' is not assignable to type 'Y' (TypeScript)TS2322NG8004 β€” Angular: NG8004: No pipe found with name 'async' / 'date' / 'translate' β€” pipe not imported (Angular)NG8004Cannot find control with name β€” Angular: Error: Cannot find control with name: 'email' (reactive forms) (Angular)Cannot find control…NG02100 β€” Angular: NG02100: InvalidPipeArgument: '[object Object]' for pipe 'AsyncPipe' (Angular)NG02100exceeded maximum budget β€” Angular build: Error: bundle initial exceeded maximum budget. Budget 1.00 MB was not met by 120.00 kB with a total of 1.12 MB (Angular)exceeded maximum bu…Schema validation failed with the following errors β€” Angular CLI: Schema validation failed with the following errors: Data path "" must NOT have additional properties(xyz) (Angular)Schema validation f…Could not find the builder's node package β€” Angular CLI: Could not find the '@angular-devkit/build-angular:browser' builder's node package / Cannot find module '@angular-devkit/build-angular/package.json' (Angular)Could not find the …AttributeError β€” AttributeError: 'X' object has no attribute 'y' (Python)AttributeErrorClassCastException β€” java.lang.ClassCastException: class A cannot be cast to class B (Java)ClassCastExceptionTS7016 β€” TS7016: Could not find a declaration file for module 'x'. 'x.js' implicitly has an 'any' type. (Node.js)TS7016NG8002 β€” Angular: NG8002: Can't bind to 'ngModel' since it isn't a known property of 'input' (Angular)NG8002NG8001 β€” Angular: NG8001: 'app-item' is not a known element β€” verify that it is included in the component's imports (Angular)NG8001NG8103 β€” Angular: NG8103: The *ngIf directive was used, but neither the NgIf directive nor the CommonModule was imported (Angular)NG8103NG0100 β€” Angular: NG0100: ExpressionChangedAfterItHasBeenCheckedError: Expression has changed after it was checked (Angular)NG0100NG8003 β€” Angular: NG8003: No directive found with exportAs 'ngForm' (template reference variable) (Angular)NG8003NG01203 β€” Angular: NG01203: No value accessor for form control with name: 'x' (ControlValueAccessor missing) (Angular)NG01203NG02200 β€” Angular: NG02200: Cannot find a differ supporting object '[object Object]' of type 'object'. NgFor only supports binding to Iterables such as Arrays (Angular)NG02200You provided 'undefined' where a stream was expected β€” RxJS: TypeError: You provided 'undefined' where a stream was expected. You can provide an Observable, Promise, ReadableStream, Array, AsyncIterable, or Iterable. (Angular)You provided 'undef…EmptyError β€” RxJS: EmptyError: no elements in sequence (firstValueFrom / lastValueFrom on an empty Observable) (Angular)EmptyErrorChunkLoadError β€” ChunkLoadError: Loading chunk 123 failed. (JavaScript)ChunkLoadErrorNG0200 β€” Angular: NG0200: Circular dependency in DI detected for X (Angular)NG0200NG0201 β€” Angular: NG0201: No provider for X found in NodeInjector (Angular)NG0201NG0203 β€” Angular: NG0203: inject() must be called from an injection context such as a constructor, a factory function, a field initializer or a function used with runInInjectionContext (Angular)NG0203NG0300 β€” Angular: NG0300: Multiple components match node with tagname app-x: A and B (Angular)NG0300NG0500 β€” Angular SSR: NG0500: During hydration Angular expected <div> but found <span> (NG0501, NG0502) (Angular)NG0500ENOENT β€” npm ERR! enoent ENOENT: no such file or directory, open '/path/package.json' (npm)ENOENTNG0600 β€” Angular: NG0600: Writing to signals is not allowed in a computed or an effect by default (Angular)NG0600NG0955 β€” Angular: NG0955: The provided track expression resulted in duplicated keys for a given collection (@for) (Angular)NG0955

Directly related (7)

TS2322TypeScript

TS2322: Type 'X' is not assignable to type 'Y'

You assigned a value whose type doesn’t match the declared type of the variable, property or return value.

NG8004Angular

Angular: NG8004: No pipe found with name 'async' / 'date' / 'translate' β€” pipe not imported

The template uses a pipe Angular does not know β€” it is not imported into the component (standalone) or its module.

Cannot find control with nameAngular

Angular: Error: Cannot find control with name: 'email' (reactive forms)

A `formControlName` points at a control that does not exist in the bound `FormGroup`.

NG02100Angular

Angular: NG02100: InvalidPipeArgument: '[object Object]' for pipe 'AsyncPipe'

The `async` pipe received a plain object or array instead of an Observable or Promise.

exceeded maximum budgetAngular

Angular build: Error: bundle initial exceeded maximum budget. Budget 1.00 MB was not met by 120.00 kB with a total of 1.12 MB

The production build is larger than the size limits (budgets) in angular.json, and the build is configured to fail.

Schema validation failed with the following errorsAngular

Angular CLI: Schema validation failed with the following errors: Data path "" must NOT have additional properties(xyz)

`angular.json` (or an option you passed to a builder) contains a property the schema does not allow β€” a typo, an option removed i…

Could not find the builder's node packageAngular

Angular CLI: Could not find the '@angular-devkit/build-angular:browser' builder's node package / Cannot find module '@angular-devkit/build-angular/package.json'

The build tooling package is missing from `node_modules` β€” dependencies were not installed or the lockfile/install is broken.

Two steps away (21)

AttributeErrorPython

AttributeError: 'X' object has no attribute 'y'

You accessed an attribute or method that doesn’t exist on that object type.

ClassCastExceptionJava

java.lang.ClassCastException: class A cannot be cast to class B

An object was cast to a type it isn’t.

TS7016Node.js

TS7016: Could not find a declaration file for module 'x'. 'x.js' implicitly has an 'any' type.

The JavaScript package has no TypeScript types bundled and no @types package installed.

NG8002Angular

Angular: NG8002: Can't bind to 'ngModel' since it isn't a known property of 'input'

The template uses a property binding that no imported directive provides β€” for ngModel, FormsModule isn’t imported.

NG8001Angular

Angular: NG8001: 'app-item' is not a known element β€” verify that it is included in the component's imports

The template uses a tag Angular does not recognise as a component β€” it was never imported (standalone) or declared/exported (NgMo…

NG8103Angular

Angular: NG8103: The *ngIf directive was used, but neither the NgIf directive nor the CommonModule was imported

A standalone component uses `*ngIf`, `*ngFor` or `ngClass` without importing the directive β€” or should migrate to the built-in `@…

NG0100Angular

Angular: NG0100: ExpressionChangedAfterItHasBeenCheckedError: Expression has changed after it was checked

A template value changed during the same change-detection cycle in which Angular already checked it (dev-mode only error).

NG8003Angular

Angular: NG8003: No directive found with exportAs 'ngForm' (template reference variable)

A template reference such as `#f="ngForm"` points at a directive Angular cannot find on that element β€” the module that provides i…

NG01203Angular

Angular: NG01203: No value accessor for form control with name: 'x' (ControlValueAccessor missing)

A form directive (`formControlName`, `ngModel`) is on an element or component that Angular cannot read/write values from.

NG02200Angular

Angular: NG02200: Cannot find a differ supporting object '[object Object]' of type 'object'. NgFor only supports binding to Iterables such as Arrays

`*ngFor` (or `@for`) was given an object, `null` shape or a non-iterable instead of an array.

You provided 'undefined' where a stream was expectedAngular

RxJS: TypeError: You provided 'undefined' where a stream was expected. You can provide an Observable, Promise, ReadableStream, Array, AsyncIterable, or Iterable.

An RxJS operator (`switchMap`, `mergeMap`, `forkJoin`, `subscribe`) received `undefined` β€” a function forgot to `return` an Obser…

EmptyErrorAngular

RxJS: EmptyError: no elements in sequence (firstValueFrom / lastValueFrom on an empty Observable)

`firstValueFrom`, `lastValueFrom`, `first()` or `last()` waited for a value but the Observable completed without emitting.

ChunkLoadErrorJavaScript

ChunkLoadError: Loading chunk 123 failed.

A lazily loaded JavaScript chunk couldn’t be downloaded β€” usually because a new deployment removed the old hashed files.

NG0200Angular

Angular: NG0200: Circular dependency in DI detected for X

Two or more services inject each other (directly or through a chain), so Angular cannot create any of them first.

NG0201Angular

Angular: NG0201: No provider for X found in NodeInjector

A component or directive asked for a service no injector in its tree provides.

NG0203Angular

Angular: NG0203: inject() must be called from an injection context such as a constructor, a factory function, a field initializer or a function used with runInInjectionContext

`inject()` was called somewhere Angular is not constructing a class β€” for example inside a method, a callback or after an `await`.

NG0300Angular

Angular: NG0300: Multiple components match node with tagname app-x: A and B

Two components in scope share the same selector, so Angular cannot decide which one renders for that tag.

NG0500Angular

Angular SSR: NG0500: During hydration Angular expected <div> but found <span> (NG0501, NG0502)

The HTML rendered on the server does not match what the browser's Angular app tried to render, so hydration failed and the page w…

ENOENTnpm

npm ERR! enoent ENOENT: no such file or directory, open '/path/package.json'

npm ran in a directory without a package.json.

NG0600Angular

Angular: NG0600: Writing to signals is not allowed in a computed or an effect by default

A `computed()` (or, by default, an `effect()`) tried to call `.set()` or `.update()` on a signal β€” that creates hidden update loo…

NG0955Angular

Angular: NG0955: The provided track expression resulted in duplicated keys for a given collection (@for)

In an `@for` block (or `trackBy`), two items produced the same tracking key, so Angular cannot match them to DOM nodes reliably.