Error map

ERESOLVE peer dependency conflict after ng update Angular: npm ERR! ERESOLVE could not resolve — Conflicting peer dependency: @angular/core@"^16.0.0" (after ng update / ng add)

Angular · layer 1, On your device

Open the full error page →

Centre: this error. First ring: errors it is linked with (8). Outer ring: what those are linked with. Colours show the layer of a request each error belongs to. Click any dot to re-centre the map on it; hover to follow its connections. The centre dot opens the error page.

ERESOLVE peer dependency conflict after ng update — Angular: npm ERR! ERESOLVE could not resolve — Conflicting peer dependency: @angular/core@"^16.0.0" (after ng update / ng add) (Angular)ERESOLVE pe…ERESOLVE — npm ERR! code ERESOLVE — unable to resolve dependency tree (npm)ERESOLVECannot find control with name — Angular: Error: Cannot find control with name: 'email' (reactive forms) (Angular)Cannot find control…Node.js version detected. The Angular CLI requires a minimum — Angular CLI: Node.js version v16.20.2 detected. The Angular CLI requires a minimum Node.js version of v18.19.1 (Angular)Node.js version det…exceeded maximum budget — Angular build: Error: bundle initial exceeded maximum budget. Budget 1.00 MB was not met by 120.00 kB with a total of 1.12 MB (Angular)exceeded maximum bu…Repository is not clean — Angular CLI: Repository is not clean. Please commit or stash any changes before updating. (Angular)Repository is not c…Schema validation failed with the following errors — Angular CLI: Schema validation failed with the following errors: Data path "" must NOT have additional properties(xyz) (Angular)Schema validation f…Could not find the builder's node package — Angular CLI: Could not find the '@angular-devkit/build-angular:browser' builder's node package / Cannot find module '@angular-devkit/build-angular/package.json' (Angular)Could not find the …The Angular Compiler requires TypeScript — Angular: Error: The Angular Compiler requires TypeScript >=5.4.0 and <5.6.0 but 5.7.2 was found instead (Angular)The Angular Compile…EACCES — npm ERR! code EACCES — permission denied (npm)EACCESMODULE_NOT_FOUND — Error: Cannot find module 'x' (MODULE_NOT_FOUND) (Node.js)MODULE_NOT_FOUNDE404 — npm ERR! code E404 — 404 Not Found: package@version is not in this registry (npm)E404NG0100 — Angular: NG0100: ExpressionChangedAfterItHasBeenCheckedError: Expression has changed after it was checked (Angular)NG0100NG8002 — Angular: NG8002: Can't bind to 'ngModel' since it isn't a known property of 'input' (Angular)NG8002NG8003 — Angular: NG8003: No directive found with exportAs 'ngForm' (template reference variable) (Angular)NG8003EBADENGINE — npm WARN EBADENGINE Unsupported engine / The engine "node" is incompatible with this module (Node.js)EBADENGINEng: command not found — Angular CLI: zsh: command not found: ng / 'ng' is not recognized as an internal or external command (Angular)ng: command not fou…Port 4200 is already in use — Angular CLI: Port 4200 is already in use. Use '--port' to specify a different port (Angular)Port 4200 is alread…ChunkLoadError — ChunkLoadError: Loading chunk 123 failed. (JavaScript)ChunkLoadErrorNG0200 — Angular: NG0200: Circular dependency in DI detected for X (Angular)NG0200NG0201 — Angular: NG0201: No provider for X found in NodeInjector (Angular)NG0201NG0203 — Angular: NG0203: inject() must be called from an injection context such as a constructor, a factory function, a field initializer or a function used with runInInjectionContext (Angular)NG0203NG0300 — Angular: NG0300: Multiple components match node with tagname app-x: A and B (Angular)NG0300NG0500 — Angular SSR: NG0500: During hydration Angular expected <div> but found <span> (NG0501, NG0502) (Angular)NG0500ENOENT — npm ERR! enoent ENOENT: no such file or directory, open '/path/package.json' (npm)ENOENTNG0600 — Angular: NG0600: Writing to signals is not allowed in a computed or an effect by default (Angular)NG0600NG0955 — Angular: NG0955: The provided track expression resulted in duplicated keys for a given collection (@for) (Angular)NG0955TS2322 — TS2322: Type 'X' is not assignable to type 'Y' (TypeScript)TS2322

Directly related (8)

ERESOLVEnpm

npm ERR! code ERESOLVE — unable to resolve dependency tree

npm 7+ found conflicting peer dependency requirements and refuses to install a broken tree.

Cannot find control with nameAngular

Angular: Error: Cannot find control with name: 'email' (reactive forms)

A `formControlName` points at a control that does not exist in the bound `FormGroup`.

Node.js version detected. The Angular CLI requires a minimumAngular

Angular CLI: Node.js version v16.20.2 detected. The Angular CLI requires a minimum Node.js version of v18.19.1

Your Node.js is older (or newer, unsupported) than the Angular CLI version needs.

exceeded maximum budgetAngular

Angular build: Error: bundle initial exceeded maximum budget. Budget 1.00 MB was not met by 120.00 kB with a total of 1.12 MB

The production build is larger than the size limits (budgets) in angular.json, and the build is configured to fail.

Repository is not cleanAngular

Angular CLI: Repository is not clean. Please commit or stash any changes before updating.

`ng update` refuses to run because git has uncommitted changes; it wants every migration to be a reviewable diff.

Schema validation failed with the following errorsAngular

Angular CLI: Schema validation failed with the following errors: Data path "" must NOT have additional properties(xyz)

`angular.json` (or an option you passed to a builder) contains a property the schema does not allow — a typo, an option removed i…

Could not find the builder's node packageAngular

Angular CLI: Could not find the '@angular-devkit/build-angular:browser' builder's node package / Cannot find module '@angular-devkit/build-angular/package.json'

The build tooling package is missing from `node_modules` — dependencies were not installed or the lockfile/install is broken.

The Angular Compiler requires TypeScriptAngular

Angular: Error: The Angular Compiler requires TypeScript >=5.4.0 and <5.6.0 but 5.7.2 was found instead

The installed TypeScript version is outside the range your Angular version supports.

Two steps away (19)

EACCESnpm

npm ERR! code EACCES — permission denied

npm can’t write to a directory — usually global installs into a root-owned folder.

MODULE_NOT_FOUNDNode.js

Error: Cannot find module 'x' (MODULE_NOT_FOUND)

Node can’t resolve the module path — the package isn’t installed, or a relative path/extension is wrong.

E404npm

npm ERR! code E404 — 404 Not Found: package@version is not in this registry

npm asked the registry for a package (or version) that doesn’t exist there — a typo, a private/scoped package without auth, or th…

NG0100Angular

Angular: NG0100: ExpressionChangedAfterItHasBeenCheckedError: Expression has changed after it was checked

A template value changed during the same change-detection cycle in which Angular already checked it (dev-mode only error).

NG8002Angular

Angular: NG8002: Can't bind to 'ngModel' since it isn't a known property of 'input'

The template uses a property binding that no imported directive provides — for ngModel, FormsModule isn’t imported.

NG8003Angular

Angular: NG8003: No directive found with exportAs 'ngForm' (template reference variable)

A template reference such as `#f="ngForm"` points at a directive Angular cannot find on that element — the module that provides i…

EBADENGINENode.js

npm WARN EBADENGINE Unsupported engine / The engine "node" is incompatible with this module

A package requires a different Node.js version than the one you’re running.

ng: command not foundAngular

Angular CLI: zsh: command not found: ng / 'ng' is not recognized as an internal or external command

The Angular CLI is not installed globally or its folder is not on your PATH.

Port 4200 is already in useAngular

Angular CLI: Port 4200 is already in use. Use '--port' to specify a different port

Another process is already listening on the dev-server port, often an earlier `ng serve` that was not stopped.

ChunkLoadErrorJavaScript

ChunkLoadError: Loading chunk 123 failed.

A lazily loaded JavaScript chunk couldn’t be downloaded — usually because a new deployment removed the old hashed files.

NG0200Angular

Angular: NG0200: Circular dependency in DI detected for X

Two or more services inject each other (directly or through a chain), so Angular cannot create any of them first.

NG0201Angular

Angular: NG0201: No provider for X found in NodeInjector

A component or directive asked for a service no injector in its tree provides.

NG0203Angular

Angular: NG0203: inject() must be called from an injection context such as a constructor, a factory function, a field initializer or a function used with runInInjectionContext

`inject()` was called somewhere Angular is not constructing a class — for example inside a method, a callback or after an `await`.

NG0300Angular

Angular: NG0300: Multiple components match node with tagname app-x: A and B

Two components in scope share the same selector, so Angular cannot decide which one renders for that tag.

NG0500Angular

Angular SSR: NG0500: During hydration Angular expected <div> but found <span> (NG0501, NG0502)

The HTML rendered on the server does not match what the browser's Angular app tried to render, so hydration failed and the page w…

ENOENTnpm

npm ERR! enoent ENOENT: no such file or directory, open '/path/package.json'

npm ran in a directory without a package.json.

NG0600Angular

Angular: NG0600: Writing to signals is not allowed in a computed or an effect by default

A `computed()` (or, by default, an `effect()`) tried to call `.set()` or `.update()` on a signal — that creates hidden update loo…

NG0955Angular

Angular: NG0955: The provided track expression resulted in duplicated keys for a given collection (@for)

In an `@for` block (or `trackBy`), two items produced the same tracking key, so Angular cannot match them to DOM nodes reliably.

TS2322TypeScript

TS2322: Type 'X' is not assignable to type 'Y'

You assigned a value whose type doesn’t match the declared type of the variable, property or return value.