Error map

invalid_request OAuth 2.0 Error: invalid_request (missing or invalid parameter)

Authentication · layer 4, Application & API

Open the full error page →

Centre: this error. First ring: errors it is linked with (12). Outer ring: what those are linked with. Colours show the layer of a request each error belongs to. Click any dot to re-centre the map on it; hover to follow its connections. The centre dot opens the error page.

invalid_request — OAuth 2.0 Error: invalid_request (missing or invalid parameter) (Authentication)invalid_req…400 — HTTP 400 Bad Request (HTTP)400PKCE verification failed — OAuth PKCE error: invalid_grant — PKCE verification failed / code_verifier does not match code_challenge / code_challenge required (Authentication)PKCE verification f…redirect_uri_mismatch — OAuth Error: redirect_uri_mismatch (Authentication)redirect_uri_mismat…auth/popup-closed-by-user — Firebase Auth: auth/popup-closed-by-user / auth/popup-blocked / auth/cancelled-popup-request (Authentication)auth/popup-closed-b…invalid_type — API Error: Invalid type — expected integer, received string (API)invalid_typeinvalid_date — API Error: Invalid date format — expected ISO 8601 (YYYY-MM-DDTHH:mm:ssZ) (API)invalid_dateinvalid_id — API Error: Invalid ID format (not a valid UUID / malformed identifier) (API)invalid_idfile_type_not_allowed — Upload error: File type not allowed / unsupported file type (API)file_type_not_allow…invalid_value — API Error: Invalid parameter value — must be one of the allowed values / out of range (API)invalid_valueadditionalProperties — API Error: Request failed schema validation (must NOT have additional properties / Additional properties are not allowed) (API)additionalPropertiesdisallowed_useragent — Google OAuth: Error 403: disallowed_useragent (sign-in from an embedded WebView) (Authentication)disallowed_useragentbad_verification_code — GitHub OAuth: {"error":"bad_verification_code","error_description":"The code passed is incorrect or expired."} (Authentication)bad_verification_co…401 — HTTP 401 Unauthorized (HTTP)401405 — HTTP 405 Method Not Allowed (HTTP)405413 — HTTP 413 Content Too Large (Request Entity Too Large) (HTTP)413invalid_grant — OAuth 2.0 Error: invalid_grant (Authentication)invalid_grantunsupported_response_type — OAuth 2.0 Error: unsupported_response_type (Authentication)unsupported_respons…state mismatch — OAuth callback error: state mismatch / Unable to verify authorization request state / State cookie was missing (Authentication)state mismatchAADSTS700016 — Azure AD (Entra ID): AADSTS700016 Application not found in the directory (Azure)AADSTS700016invalid_client — OAuth 2.0 Error: invalid_client (Authentication)invalid_clientdivergent branches — hint: You have divergent branches and need to specify how to reconcile them. (Git)divergent branchesFailed to fetch — TypeError: Failed to fetch / NetworkError when attempting to fetch resource (JavaScript)Failed to fetchinvalid_scope — OAuth 2.0 Error: invalid_scope / insufficient_scope (Authentication)invalid_scopeQuotaExceededError — QuotaExceededError: Failed to execute 'setItem' on 'Storage': Setting the value exceeded the quota (JavaScript)QuotaExceededError422 — HTTP 422 Unprocessable Content (HTTP)4221406 — MySQL ERROR 1406: Data too long for column (MySQL)1406NumberFormatException — java.lang.NumberFormatException: For input string: "x" (Java)NumberFormatExcepti…IllegalArgumentException — java.lang.IllegalArgumentException (Java)IllegalArgumentExce…DateTimeParseException — java.time.format.DateTimeParseException: Text '31/12/2024' could not be parsed at index 2 (Java)DateTimeParseExcept…Unparseable date — java.text.ParseException: Unparseable date: "x" (Java)Unparseable dateCastError ObjectId — CastError: Cast to ObjectId failed for value "x" (type string) at path "_id" (Node.js)CastError ObjectId22P02 uuid — ERROR: invalid input syntax for type uuid: "x" (PostgreSQL)22P02 uuidparameter_missing — API Error: Missing required parameter (parameter_missing / "x" is required) (API)parameter_missing415 — HTTP 415 Unsupported Media Type (HTTP)415Link expired — WordPress: The link you followed has expired (WordPress)Link expiredNot allowed — WordPress: Sorry, you are not allowed to access this page. (WordPress)Not allowedMethodArgumentNotValidException — MethodArgumentNotValidException: Validation failed for argument [0] (Java)MethodArgumentNotVa…1048 — MySQL ERROR 1048 (23000): Column 'x' cannot be null (MySQL)10481264 — MySQL ERROR 1264 (22003): Out of range value for column 'x' at row 1 (MySQL)12641146 — MySQL ERROR 1146 (42S02): Table 'db.table' doesn't exist (MySQL)11461054 — MySQL ERROR 1054 (42S22): Unknown column in 'field list' (MySQL)105442P01 — PostgreSQL: ERROR: relation "x" does not exist (PostgreSQL)42P01access_denied — OAuth 2.0 Error: access_denied (The user or authorization server denied the request) (Authentication)access_deniedGoogle hasn't verified this app — Google OAuth: Google hasn't verified this app / This app isn't verified (Authentication)Google hasn't verif…deleted_client — Google OAuth: Error 401: deleted_client — The OAuth client was deleted (Authentication)deleted_clientAADSTS500113 — AADSTS500113: No reply address is registered for the application (Azure)AADSTS500113unsupported_grant_type — OAuth 2.0 Error: unsupported_grant_type (Authentication)unsupported_grant_t…Access blocked: has not completed the Google verification process — Google OAuth: Error 403: access_denied — The developer hasn't given you access to this app / has not completed the Google verification process (Authentication)Access blocked: has…

Directly related (12)

400HTTP

HTTP 400 Bad Request

The server could not understand the request because its syntax, headers or body are malformed or invalid.

PKCE verification failedAuthentication

OAuth PKCE error: invalid_grant — PKCE verification failed / code_verifier does not match code_challenge / code_challenge required

The code_verifier sent to the token endpoint doesn’t match the code_challenge from the authorize request, or PKCE is required but…

redirect_uri_mismatchAuthentication

OAuth Error: redirect_uri_mismatch

The redirect URI in your OAuth request doesn’t exactly match one registered for the client in the provider’s console.

auth/popup-closed-by-userAuthentication

Firebase Auth: auth/popup-closed-by-user / auth/popup-blocked / auth/cancelled-popup-request

The OAuth popup for Google/GitHub sign-in was closed, blocked by the browser, or replaced by another popup request.

invalid_typeAPI

API Error: Invalid type — expected integer, received string

A request field has the wrong data type — a string where the API expects a number, a number where it expects a boolean, an object…

invalid_dateAPI

API Error: Invalid date format — expected ISO 8601 (YYYY-MM-DDTHH:mm:ssZ)

A date or timestamp in the request isn’t in the format the API expects — usually ISO 8601 with a time zone, or a Unix timestamp.

invalid_idAPI

API Error: Invalid ID format (not a valid UUID / malformed identifier)

An ID in the URL or body doesn’t have the shape the API expects — a malformed UUID, wrong prefix, or an ID mangled by encoding or…

file_type_not_allowedAPI

Upload error: File type not allowed / unsupported file type

The upload was rejected because the file’s type — extension, MIME type or actual content — isn’t on the allowed list.

invalid_valueAPI

API Error: Invalid parameter value — must be one of the allowed values / out of range

The field has the right type but a value the API doesn’t allow — not in the list of accepted options, too small or large, too lon…

additionalPropertiesAPI

API Error: Request failed schema validation (must NOT have additional properties / Additional properties are not allowed)

The JSON body doesn’t match the endpoint’s schema — an unknown property, wrong nesting, or a missing required object.

disallowed_useragentAuthentication

Google OAuth: Error 403: disallowed_useragent (sign-in from an embedded WebView)

Google blocks OAuth sign-in inside embedded WebViews (in-app browsers, Electron BrowserWindow, React Native WebView).

bad_verification_codeAuthentication

GitHub OAuth: {"error":"bad_verification_code","error_description":"The code passed is incorrect or expired."}

The authorization code sent to GitHub’s token endpoint was already used, expired (10 minutes), or belongs to another OAuth app.

Two steps away (36)

401HTTP

HTTP 401 Unauthorized

The request has no valid authentication credentials — you need to log in or send a valid token.

405HTTP

HTTP 405 Method Not Allowed

The URL exists, but it doesn’t accept the HTTP method you used (e.g. POST to a GET-only route).

413HTTP

HTTP 413 Content Too Large (Request Entity Too Large)

The request body is bigger than the server is willing to accept — usually a file upload over the configured limit.

invalid_grantAuthentication

OAuth 2.0 Error: invalid_grant

The authorization code, refresh token or credentials sent to the token endpoint are invalid, expired, already used or were issued…

unsupported_response_typeAuthentication

OAuth 2.0 Error: unsupported_response_type

The authorize request asked for a response_type the client or server doesn’t allow — e.g. token (implicit) when only code is enab…

state mismatchAuthentication

OAuth callback error: state mismatch / Unable to verify authorization request state / State cookie was missing

The state value returned to the callback doesn’t match what the app stored before redirecting — the CSRF protection for OAuth fai…

AADSTS700016Azure

Azure AD (Entra ID): AADSTS700016 Application not found in the directory

The client ID in your sign-in request doesn’t exist in the tenant you’re authenticating against.

invalid_clientAuthentication

OAuth 2.0 Error: invalid_client

The OAuth server couldn’t authenticate your application — wrong client ID/secret, wrong auth method, or the client doesn’t exist…

divergent branchesGit

hint: You have divergent branches and need to specify how to reconcile them.

Git 2.27+ asks you to choose merge, rebase or fast-forward-only when local and remote both have new commits.

Failed to fetchJavaScript

TypeError: Failed to fetch / NetworkError when attempting to fetch resource

The browser couldn’t complete the request at the network level — CORS, DNS, offline, blocked mixed content, or the server refused…

invalid_scopeAuthentication

OAuth 2.0 Error: invalid_scope / insufficient_scope

The requested scope is unknown or not allowed for this client — or the token lacks the scope the API endpoint requires.

QuotaExceededErrorJavaScript

QuotaExceededError: Failed to execute 'setItem' on 'Storage': Setting the value exceeded the quota

localStorage/sessionStorage is full (about 5 MB per origin) or storage is disabled.

422HTTP

HTTP 422 Unprocessable Content

The request is well-formed, but the data fails validation (e.g. invalid email, missing required field).

1406MySQL

MySQL ERROR 1406: Data too long for column

The value is longer than the column allows (e.g. 300 characters into VARCHAR(255)), and strict mode rejects it instead of truncat…

NumberFormatExceptionJava

java.lang.NumberFormatException: For input string: "x"

A string couldn’t be parsed as a number — it’s empty, has spaces/commas, is too large, or isn’t numeric.

IllegalArgumentExceptionJava

java.lang.IllegalArgumentException

A method rejected an argument value as invalid.

DateTimeParseExceptionJava

java.time.format.DateTimeParseException: Text '31/12/2024' could not be parsed at index 2

A java.time parse call got text that doesn’t match the expected format.

Unparseable dateJava

java.text.ParseException: Unparseable date: "x"

SimpleDateFormat couldn’t parse the string with its pattern.

CastError ObjectIdNode.js

CastError: Cast to ObjectId failed for value "x" (type string) at path "_id"

A value that isn’t a valid 24-hex-character ObjectId was used in an _id query.

22P02 uuidPostgreSQL

ERROR: invalid input syntax for type uuid: "x"

A value that isn’t a valid UUID was compared with or inserted into a uuid column.

parameter_missingAPI

API Error: Missing required parameter (parameter_missing / "x" is required)

The API rejected the request because a field it requires — in the query string, path, headers or JSON body — wasn’t sent or was e…

415HTTP

HTTP 415 Unsupported Media Type

The server refuses the request because the body’s Content-Type isn’t one it accepts.

Link expiredWordPress

WordPress: The link you followed has expired

Usually an upload (theme, plugin, media) larger than PHP’s upload/post limits — WordPress receives an empty request and shows thi…

Not allowedWordPress

WordPress: Sorry, you are not allowed to access this page.

Your user role lacks the capability for that admin screen — or the database table prefix / user capabilities are out of sync afte…

MethodArgumentNotValidExceptionJava

MethodArgumentNotValidException: Validation failed for argument [0]

Bean Validation (@Valid with @NotNull, @Email, @Size…) rejected the request body.

1048MySQL

MySQL ERROR 1048 (23000): Column 'x' cannot be null

An INSERT/UPDATE put NULL into a NOT NULL column.

1264MySQL

MySQL ERROR 1264 (22003): Out of range value for column 'x' at row 1

A number is too large (or negative for UNSIGNED) for the column type.

1146MySQL

MySQL ERROR 1146 (42S02): Table 'db.table' doesn't exist

The query references a table that MySQL can’t find in that database.

1054MySQL

MySQL ERROR 1054 (42S22): Unknown column in 'field list'

The query references a column that doesn’t exist in the table (or an unquoted string being read as a column).

42P01PostgreSQL

PostgreSQL: ERROR: relation "x" does not exist

The table/view isn’t found — missing migration, wrong schema, or a case-sensitive quoted name.

access_deniedAuthentication

OAuth 2.0 Error: access_denied (The user or authorization server denied the request)

The authorization request was refused — the user clicked Cancel/Deny on the consent screen, or a policy denied access.

Google hasn't verified this appAuthentication

Google OAuth: Google hasn't verified this app / This app isn't verified

The OAuth app requests sensitive or restricted scopes and hasn’t passed Google’s verification, so users see a warning screen.

deleted_clientAuthentication

Google OAuth: Error 401: deleted_client — The OAuth client was deleted

The OAuth client ID used in the request has been deleted from the Google Cloud project.

AADSTS500113Azure

AADSTS500113: No reply address is registered for the application

The app registration has no redirect URI for the platform being used, so Entra ID has nowhere to send the response.

unsupported_grant_typeAuthentication

OAuth 2.0 Error: unsupported_grant_type

The token endpoint didn’t recognise grant_type — usually because the body wasn’t sent as application/x-www-form-urlencoded, or th…

Access blocked: has not completed the Google verification processAuthentication

Google OAuth: Error 403: access_denied — The developer hasn't given you access to this app / has not completed the Google verification process

The Google OAuth app is in “Testing” publishing status and the signing-in account isn’t listed as a test user.