Error map

login_required OIDC Error: login_required / interaction_required / consent_required (silent authentication failed)

Authentication · layer 4, Application & API

Open the full error page →

Centre: this error. First ring: errors it is linked with (12). Outer ring: what those are linked with. Colours show the layer of a request each error belongs to. Click any dot to re-centre the map on it; hover to follow its connections. The centre dot opens the error page.

login_required — OIDC Error: login_required / interaction_required / consent_required (silent authentication failed) (Authentication)login_requi…invalid_grant — OAuth 2.0 Error: invalid_grant (Authentication)invalid_grantFailed to serialize user into session — Passport.js: Error: Failed to serialize user into session (Authentication)Failed to serialize…session_start() — Warning: session_start(): Session cannot be started after headers have already been sent (PHP)session_start()session save path — Warning: session_start(): open(/var/lib/php/sessions/sess_x, O_RDWR) failed: Permission denied (PHP)session save pathSession has not been configured — InvalidOperationException: Session has not been configured for this application or request (.NET)Session has not bee…nonce mismatch — OIDC Error: nonce mismatch / ID token nonce did not match / unexpected nonce (Authentication)nonce mismatchExpiredToken — AWS: ExpiredToken — The security token included in the request is expired (AWS)ExpiredTokenCookies are blocked — WordPress login: Error: Cookies are blocked or not supported by your browser. You must enable cookies to use WordPress. (WordPress)Cookies are blockedstate mismatch — OAuth callback error: state mismatch / Unable to verify authorization request state / State cookie was missing (Authentication)state mismatchaccess_denied — OAuth 2.0 Error: access_denied (The user or authorization server denied the request) (Authentication)access_denied431 — HTTP 431 Request Header Fields Too Large (HTTP)431invalid csrf token — ForbiddenError: invalid csrf token (EBADCSRFTOKEN) (Authentication)invalid csrf tokenAADSTS700016 — Azure AD (Entra ID): AADSTS700016 Application not found in the directory (Azure)AADSTS700016400 — HTTP 400 Bad Request (HTTP)400401 — HTTP 401 Unauthorized (HTTP)401SameSite cookie blocked — This Set-Cookie was blocked because it had the "SameSite=Lax" attribute but came from a cross-site response / SameSite=None requires Secure (Authentication)SameSite cookie blo…Illegal arguments: undefined, string — bcrypt error: Illegal arguments: undefined, string / data and salt arguments required / data and hash arguments required (Authentication)Illegal arguments: …Headers already sent — Warning: Cannot modify header information - headers already sent (PHP)Headers already sentCORS — CORS Error: No 'Access-Control-Allow-Origin' header is present (API)CORS411 — HTTP 411 Length Required (HTTP)411daemon — Cannot connect to the Docker daemon at unix:///var/run/docker.sock. Is the docker daemon running? (Docker)daemon403 — HTTP 403 Forbidden (HTTP)403invalid_scope — OAuth 2.0 Error: invalid_scope / insufficient_scope (Authentication)invalid_scopeCORS wildcard with credentials — ASP.NET Core: The CORS protocol does not allow specifying a wildcard (any) origin and credentials at the same time (.NET)CORS wildcard with …The request matched multiple endpoints — AmbiguousMatchException: The request matched multiple endpoints. Matches: X, Y (.NET)The request matched…antiforgery token could not be decrypted — ASP.NET Core: The antiforgery token could not be decrypted / The required antiforgery cookie is not present (400 Bad Request) (.NET)antiforgery token c…webhook signature — Webhook signature verification failed (Stripe, Razorpay, GitHub…) (API)webhook signatureinvalid_token — invalid_token: The access token is invalid (JsonWebTokenError: invalid signature / jwt malformed) (Authentication)invalid_tokenSecurityException: Permission Denial — java.lang.SecurityException: Permission Denial ... requires android.permission.X (Android)SecurityException: …AccessDenied — AWS S3: AccessDenied (403) when calling GetObject / PutObject (AWS)AccessDeniedkubectl connection refused — kubectl: The connection to the server localhost:8080 was refused — did you specify the right host or port? (Kubernetes)kubectl connection …NoCredentialsError — AWS: Unable to locate credentials / Could not load credentials from any providers (AWS)NoCredentialsErrorERR_TOO_MANY_REDIRECTS (WordPress) — WordPress: ERR_TOO_MANY_REDIRECTS / redirected you too many times on wp-admin or the whole site (WordPress)ERR_TOO_MANY_REDIRE…404 except homepage — WordPress: 404 Not Found on every page except the homepage (permalinks / .htaccess / Nginx rules) (WordPress)404 except homepage403 Forbidden wp-admin — WordPress: 403 Forbidden on wp-admin, wp-login.php or admin-ajax.php (WordPress)403 Forbidden wp-ad…419 Page Expired — Laravel: 419 Page Expired (CSRF token mismatch) (PHP)419 Page ExpiredDjango CSRF — Forbidden (403) CSRF verification failed. Request aborted. (Python)Django CSRFPKCE verification failed — OAuth PKCE error: invalid_grant — PKCE verification failed / code_verifier does not match code_challenge / code_challenge required (Authentication)PKCE verification f…PERMISSION_DENIED — PERMISSION_DENIED: The caller does not have permission (insufficient permissions) (Authentication)PERMISSION_DENIEDAADSTS65001 — AADSTS65001: The user or administrator has not consented to use the application (Azure)AADSTS65001Access blocked: has not completed the Google verification process — Google OAuth: Error 403: access_denied — The developer hasn't given you access to this app / has not completed the Google verification process (Authentication)Access blocked: has…413 — HTTP 413 Content Too Large (Request Entity Too Large) (HTTP)413414 — HTTP 414 URI Too Long (HTTP)414ERR_HTTP2_PROTOCOL_ERROR — Chrome: This page isn’t working — example.com is unable to handle this request. ERR_HTTP2_PROTOCOL_ERROR (Browser)ERR_HTTP2_PROTOCOL_…violates PodSecurity — Error creating: pods is forbidden: violates PodSecurity "restricted:latest": allowPrivilegeEscalation != false ... (Kubernetes)violates PodSecurityREMOTE HOST IDENTIFICATION HAS CHANGED — WARNING: REMOTE HOST IDENTIFICATION HAS CHANGED! (ssh host key changed) (Linux)REMOTE HOST IDENTIF…NO_PUBKEY — The following signatures couldn't be verified because the public key is not available: NO_PUBKEY (Linux)NO_PUBKEY

Directly related (12)

invalid_grantAuthentication

OAuth 2.0 Error: invalid_grant

The authorization code, refresh token or credentials sent to the token endpoint are invalid, expired, already used or were issued…

Failed to serialize user into sessionAuthentication

Passport.js: Error: Failed to serialize user into session

Passport logged a user in but there’s no serializeUser function (or it didn’t call done), so the session can’t store the user.

session_start()PHP

Warning: session_start(): Session cannot be started after headers have already been sent

session_start() ran after output was sent, so PHP can’t set the session cookie.

session save pathPHP

Warning: session_start(): open(/var/lib/php/sessions/sess_x, O_RDWR) failed: Permission denied

PHP can’t write session files to the configured session.save_path.

Session has not been configured.NET

InvalidOperationException: Session has not been configured for this application or request

Code used HttpContext.Session, but session services/middleware aren’t registered — or UseSession runs after the endpoint that nee…

nonce mismatchAuthentication

OIDC Error: nonce mismatch / ID token nonce did not match / unexpected nonce

The nonce inside the ID token doesn’t match the one the app stored — the replay protection check failed.

ExpiredTokenAWS

AWS: ExpiredToken — The security token included in the request is expired

Temporary AWS credentials (STS/SSO/assumed role) have expired.

Cookies are blockedWordPress

WordPress login: Error: Cookies are blocked or not supported by your browser. You must enable cookies to use WordPress.

WordPress’s test cookie wasn’t returned on login — often a siteurl/home or domain mismatch, caching of wp-login.php, or headers a…

state mismatchAuthentication

OAuth callback error: state mismatch / Unable to verify authorization request state / State cookie was missing

The state value returned to the callback doesn’t match what the app stored before redirecting — the CSRF protection for OAuth fai…

access_deniedAuthentication

OAuth 2.0 Error: access_denied (The user or authorization server denied the request)

The authorization request was refused — the user clicked Cancel/Deny on the consent screen, or a policy denied access.

431HTTP

HTTP 431 Request Header Fields Too Large

The request headers — almost always cookies — exceed the server’s size limit.

invalid csrf tokenAuthentication

ForbiddenError: invalid csrf token (EBADCSRFTOKEN)

The request’s CSRF token is missing or doesn’t match the token tied to the user’s session/cookie.

Two steps away (35)

AADSTS700016Azure

Azure AD (Entra ID): AADSTS700016 Application not found in the directory

The client ID in your sign-in request doesn’t exist in the tenant you’re authenticating against.

400HTTP

HTTP 400 Bad Request

The server could not understand the request because its syntax, headers or body are malformed or invalid.

401HTTP

HTTP 401 Unauthorized

The request has no valid authentication credentials — you need to log in or send a valid token.

SameSite cookie blockedAuthentication

This Set-Cookie was blocked because it had the "SameSite=Lax" attribute but came from a cross-site response / SameSite=None requires Secure

The browser refused to store or send an auth/session cookie because of SameSite or Secure rules — so logins don’t “stick” across…

Illegal arguments: undefined, stringAuthentication

bcrypt error: Illegal arguments: undefined, string / data and salt arguments required / data and hash arguments required

bcrypt.compare/hash received undefined — the password field or stored hash wasn’t passed.

Headers already sentPHP

Warning: Cannot modify header information - headers already sent

You called `header()`, `setcookie()` or `session_start()` after output had already been sent to the browser.

CORSAPI

CORS Error: No 'Access-Control-Allow-Origin' header is present

The browser blocked a cross-origin request because the server’s response didn’t include the CORS headers allowing your site’s ori…

411HTTP

HTTP 411 Length Required

The server refuses a request with a body but no Content-Length header.

daemonDocker

Cannot connect to the Docker daemon at unix:///var/run/docker.sock. Is the docker daemon running?

The docker CLI can’t talk to the Docker engine — it isn’t running, or your user can’t access the socket.

403HTTP

HTTP 403 Forbidden

The server understood the request but refuses to authorize it — you (or the server process) are not allowed to access this resour…

invalid_scopeAuthentication

OAuth 2.0 Error: invalid_scope / insufficient_scope

The requested scope is unknown or not allowed for this client — or the token lacks the scope the API endpoint requires.

CORS wildcard with credentials.NET

ASP.NET Core: The CORS protocol does not allow specifying a wildcard (any) origin and credentials at the same time

The CORS policy uses AllowAnyOrigin() together with AllowCredentials(), which browsers forbid.

The request matched multiple endpoints.NET

AmbiguousMatchException: The request matched multiple endpoints. Matches: X, Y

Two controller actions or minimal API endpoints have the same route and HTTP method.

antiforgery token could not be decrypted.NET

ASP.NET Core: The antiforgery token could not be decrypted / The required antiforgery cookie is not present (400 Bad Request)

Form POST failed antiforgery validation — the token is missing, the cookie is missing, or Data Protection keys changed so old tok…

webhook signatureAPI

Webhook signature verification failed (Stripe, Razorpay, GitHub…)

Your endpoint computed a different HMAC signature than the one the provider sent, so the webhook is rejected.

invalid_tokenAuthentication

invalid_token: The access token is invalid (JsonWebTokenError: invalid signature / jwt malformed)

A token was sent but the server couldn’t verify it — bad signature, malformed, revoked, or issued for another audience or environ…

SecurityException: Permission DenialAndroid

java.lang.SecurityException: Permission Denial ... requires android.permission.X

The app called an API that needs a permission it hasn’t declared or the user hasn’t granted at runtime.

AccessDeniedAWS

AWS S3: AccessDenied (403) when calling GetObject / PutObject

An IAM policy, bucket policy, ACL/ownership setting, Block Public Access or KMS key policy denied the S3 request.

kubectl connection refusedKubernetes

kubectl: The connection to the server localhost:8080 was refused — did you specify the right host or port?

kubectl has no usable kubeconfig, so it falls back to localhost:8080 — or the cluster API server is unreachable.

NoCredentialsErrorAWS

AWS: Unable to locate credentials / Could not load credentials from any providers

The AWS CLI/SDK found no credentials in any place it looks — env vars, profile files, SSO cache or an instance/task role.

ERR_TOO_MANY_REDIRECTS (WordPress)WordPress

WordPress: ERR_TOO_MANY_REDIRECTS / redirected you too many times on wp-admin or the whole site

WordPress and the server/proxy keep redirecting to each other — usually siteurl/home mismatch (http vs https, www vs non-www) or…

404 except homepageWordPress

WordPress: 404 Not Found on every page except the homepage (permalinks / .htaccess / Nginx rules)

Pretty permalinks aren’t being routed to index.php — .htaccess is missing/ignored (Apache) or Nginx lacks try_files.

403 Forbidden wp-adminWordPress

WordPress: 403 Forbidden on wp-admin, wp-login.php or admin-ajax.php

The server or a security layer refused access to WordPress admin URLs — file permissions, a security plugin/WAF rule, ModSecurity…

419 Page ExpiredPHP

Laravel: 419 Page Expired (CSRF token mismatch)

Laravel rejected a POST because the CSRF token was missing, expired or didn’t match the session.

Django CSRFPython

Forbidden (403) CSRF verification failed. Request aborted.

Django rejected a POST because the CSRF token was missing, wrong, or the request origin isn’t trusted.

PKCE verification failedAuthentication

OAuth PKCE error: invalid_grant — PKCE verification failed / code_verifier does not match code_challenge / code_challenge required

The code_verifier sent to the token endpoint doesn’t match the code_challenge from the authorize request, or PKCE is required but…

PERMISSION_DENIEDAuthentication

PERMISSION_DENIED: The caller does not have permission (insufficient permissions)

You are authenticated, but your identity isn’t allowed to perform this action on this resource.

AADSTS65001Azure

AADSTS65001: The user or administrator has not consented to use the application

The app needs permissions that haven’t been granted for this user or tenant.

Access blocked: has not completed the Google verification processAuthentication

Google OAuth: Error 403: access_denied — The developer hasn't given you access to this app / has not completed the Google verification process

The Google OAuth app is in “Testing” publishing status and the signing-in account isn’t listed as a test user.

413HTTP

HTTP 413 Content Too Large (Request Entity Too Large)

The request body is bigger than the server is willing to accept — usually a file upload over the configured limit.

414HTTP

HTTP 414 URI Too Long

The request URL (usually the query string) is longer than the server will accept.

ERR_HTTP2_PROTOCOL_ERRORBrowser

Chrome: This page isn’t working — example.com is unable to handle this request. ERR_HTTP2_PROTOCOL_ERROR

The HTTP/2 connection broke a protocol rule — a server, proxy or CDN sent an invalid or oversized frame/header, or closed the str…

violates PodSecurityKubernetes

Error creating: pods is forbidden: violates PodSecurity "restricted:latest": allowPrivilegeEscalation != false ...

The namespace enforces a Pod Security Standard (baseline/restricted) and the pod spec breaks one of its rules.

REMOTE HOST IDENTIFICATION HAS CHANGEDLinux

WARNING: REMOTE HOST IDENTIFICATION HAS CHANGED! (ssh host key changed)

The server’s SSH host key differs from the one saved in ~/.ssh/known_hosts — usually because the server was rebuilt or the IP was…

NO_PUBKEYLinux

The following signatures couldn't be verified because the public key is not available: NO_PUBKEY

apt can’t verify a repository’s signature because the repo’s signing key isn’t installed (or has expired/rotated).