Error map

AADSTS65001 AADSTS65001: The user or administrator has not consented to use the application

Azure · layer 6, Platform & cloud

Open the full error page →

Centre: this error. First ring: errors it is linked with (12). Outer ring: what those are linked with. Colours show the layer of a request each error belongs to. Click any dot to re-centre the map on it; hover to follow its connections. The centre dot opens the error page.

AADSTS65001 — AADSTS65001: The user or administrator has not consented to use the application (Azure)AADSTS65001403 — HTTP 403 Forbidden (HTTP)403readonly database — sqlite3.OperationalError: attempt to write a readonly database (SQL)readonly databaseOperation not permitted (macOS privacy) — macOS: Operation not permitted — Terminal/app lacks Full Disk Access (TCC privacy protection) (macOS)Operation not permi…daemon — Cannot connect to the Docker daemon at unix:///var/run/docker.sock. Is the docker daemon running? (Docker)daemonsession save path — Warning: session_start(): open(/var/lib/php/sessions/sess_x, O_RDWR) failed: Permission denied (PHP)session save pathinvalid_scope — OAuth 2.0 Error: invalid_scope / insufficient_scope (Authentication)invalid_scopesudoers — user is not in the sudoers file. This incident will be reported. (Linux)sudoersAccessDeniedException — java.nio.file.AccessDeniedException: /path (Java)AccessDeniedExcepti…listen EACCES — Error: listen EACCES: permission denied 0.0.0.0:80 (Node.js)listen EACCESPERMISSION_DENIED — PERMISSION_DENIED: The caller does not have permission (insufficient permissions) (Authentication)PERMISSION_DENIEDAADSTS50053 — AADSTS50053: Your account is locked (Smart Lockout) / sign-in blocked due to suspicious activity (Azure)AADSTS50053Access to the path is denied — System.UnauthorizedAccessException: Access to the path 'x' is denied (.NET)Access to the path …publickey — Git: Permission denied (publickey). fatal: Could not read from remote repository. (Git)publickeyAccessDenied — AWS S3: AccessDenied (403) when calling GetObject / PutObject (AWS)AccessDeniedEACCES — Linux: Permission denied (Linux)EACCESSQLITE_BUSY — sqlite3.OperationalError: database is locked (SQLITE_BUSY) (SQL)SQLITE_BUSYSQLite no such column — sqlite3.OperationalError: no such column: x (SQL)SQLite no such colu…SQLite UNIQUE failed — sqlite3.IntegrityError: UNIQUE constraint failed: users.email (SQL)SQLite UNIQUE failedEACCES — npm ERR! code EACCES — permission denied (npm)EACCES0x80070005 — Windows Error 0x80070005 (E_ACCESSDENIED): Access is denied (Windows)0x80070005Not allowed — WordPress: Sorry, you are not allowed to access this page. (WordPress)Not allowed2002 — MySQL ERROR 2002 (HY000): Can't connect to local MySQL server through socket (MySQL)2002port is already allocated — Docker: Bind for 0.0.0.0:80 failed: port is already allocated (Docker)port is already all…ENOTFOUND — Error: getaddrinfo ENOTFOUND host / Name or service not known (API)ENOTFOUNDExpiredToken — AWS: ExpiredToken — The security token included in the request is expired (AWS)ExpiredToken401 — HTTP 401 Unauthorized (HTTP)401session_start() — Warning: session_start(): Session cannot be started after headers have already been sent (PHP)session_start()invalid_grant — OAuth 2.0 Error: invalid_grant (Authentication)invalid_grantinvalid_client — OAuth 2.0 Error: invalid_client (Authentication)invalid_clientclipboard write blocked — NotAllowedError: Failed to execute 'writeText' on 'Clipboard': Document is not focused. (JavaScript)clipboard write blo…dpkg lock — E: Could not get lock /var/lib/dpkg/lock-frontend — is another process using it? (Linux)dpkg lockUNPROTECTED PRIVATE KEY FILE — WARNING: UNPROTECTED PRIVATE KEY FILE! Permissions 0644 for 'key.pem' are too open (Linux)UNPROTECTED PRIVATE…sudo: unable to resolve host — sudo: unable to resolve host <hostname>: Name or service not known (Linux)sudo: unable to res…StringIndexOutOfBoundsException — java.lang.StringIndexOutOfBoundsException: begin 0, end 10, length 5 (Java)StringIndexOutOfBou…ArithmeticException — java.lang.ArithmeticException: / by zero (Java)ArithmeticExceptionUnsupportedOperationException — java.lang.UnsupportedOperationException (List.of / Arrays.asList is immutable) (Java)UnsupportedOperatio…EADDRINUSE — Error: listen EADDRINUSE: address already in use :::3000 (Node.js)EADDRINUSEEPERM — Error: EPERM: operation not permitted, rename / unlink (Node.js)EPERMUnhandled 'error' event — Error: Unhandled 'error' event (events.js / node:events) (Node.js)Unhandled 'error' e…AuthorizationFailed — Azure: AuthorizationFailed — The client does not have authorization to perform action (Azure)AuthorizationFailedAuthorizationPermissionMismatch — Azure Storage: AuthorizationPermissionMismatch (403) — This request is not authorized to perform this operation using this permission (Azure)AuthorizationPermis…spawn EACCES — Error: spawn EACCES (Node.js)spawn EACCESwebhook signature — Webhook signature verification failed (Stripe, Razorpay, GitHub…) (API)webhook signatureviolates PodSecurity — Error creating: pods is forbidden: violates PodSecurity "restricted:latest": allowPrivilegeEscalation != false ... (Kubernetes)violates PodSecurityREMOTE HOST IDENTIFICATION HAS CHANGED — WARNING: REMOTE HOST IDENTIFICATION HAS CHANGED! (ssh host key changed) (Linux)REMOTE HOST IDENTIF…ENOENT — Error: ENOENT: no such file or directory (Node.js)ENOENTFileNotFoundException — java.io.FileNotFoundException: config.properties (No such file or directory) (Java)FileNotFoundExcepti…NoSuchFileException — java.nio.file.NoSuchFileException: /path/file (Java)NoSuchFileException

Directly related (12)

403HTTP

HTTP 403 Forbidden

The server understood the request but refuses to authorize it — you (or the server process) are not allowed to access this resour…

readonly databaseSQL

sqlite3.OperationalError: attempt to write a readonly database

The process can’t write to the SQLite file or its directory.

Operation not permitted (macOS privacy)macOS

macOS: Operation not permitted — Terminal/app lacks Full Disk Access (TCC privacy protection)

macOS privacy protection (TCC) blocked access to protected folders (Desktop, Documents, Downloads, Mail, Photos, external volumes…

daemonDocker

Cannot connect to the Docker daemon at unix:///var/run/docker.sock. Is the docker daemon running?

The docker CLI can’t talk to the Docker engine — it isn’t running, or your user can’t access the socket.

session save pathPHP

Warning: session_start(): open(/var/lib/php/sessions/sess_x, O_RDWR) failed: Permission denied

PHP can’t write session files to the configured session.save_path.

invalid_scopeAuthentication

OAuth 2.0 Error: invalid_scope / insufficient_scope

The requested scope is unknown or not allowed for this client — or the token lacks the scope the API endpoint requires.

sudoersLinux

user is not in the sudoers file. This incident will be reported.

Your account isn’t allowed to use sudo.

AccessDeniedExceptionJava

java.nio.file.AccessDeniedException: /path

The OS denied a file operation to the Java process.

listen EACCESNode.js

Error: listen EACCES: permission denied 0.0.0.0:80

Node isn’t allowed to bind that port — ports below 1024 need root on Linux/macOS, and some Windows ports are reserved.

PERMISSION_DENIEDAuthentication

PERMISSION_DENIED: The caller does not have permission (insufficient permissions)

You are authenticated, but your identity isn’t allowed to perform this action on this resource.

AADSTS50053Azure

AADSTS50053: Your account is locked (Smart Lockout) / sign-in blocked due to suspicious activity

Too many failed sign-ins (or sign-ins from a malicious IP) triggered Entra Smart Lockout.

Access to the path is denied.NET

System.UnauthorizedAccessException: Access to the path 'x' is denied

The process’s identity can’t read/write that file or folder — IIS app pool identity, container user, read-only attribute, or a di…

Two steps away (36)

publickeyGit

Git: Permission denied (publickey). fatal: Could not read from remote repository.

SSH authentication to GitHub/GitLab/Bitbucket failed — no key, wrong key, or the key isn’t added to your account.

AccessDeniedAWS

AWS S3: AccessDenied (403) when calling GetObject / PutObject

An IAM policy, bucket policy, ACL/ownership setting, Block Public Access or KMS key policy denied the S3 request.

EACCESLinux

Linux: Permission denied

Your user (or the service user) lacks read/write/execute permission on a file, directory or one of its parents.

SQLITE_BUSYSQL

sqlite3.OperationalError: database is locked (SQLITE_BUSY)

Another connection holds a write lock on the SQLite file, and this one gave up waiting.

SQLite no such columnSQL

sqlite3.OperationalError: no such column: x

SQLite can’t find the column — missing migration, typo, or a string written in double quotes.

SQLite UNIQUE failedSQL

sqlite3.IntegrityError: UNIQUE constraint failed: users.email

An insert/update duplicated a value in a UNIQUE or PRIMARY KEY column in SQLite.

EACCESnpm

npm ERR! code EACCES — permission denied

npm can’t write to a directory — usually global installs into a root-owned folder.

0x80070005Windows

Windows Error 0x80070005 (E_ACCESSDENIED): Access is denied

Windows refused an operation because the account or process lacks permission — seen in Windows Update, installers, Task Scheduler…

Not allowedWordPress

WordPress: Sorry, you are not allowed to access this page.

Your user role lacks the capability for that admin screen — or the database table prefix / user capabilities are out of sync afte…

2002MySQL

MySQL ERROR 2002 (HY000): Can't connect to local MySQL server through socket

The client couldn’t reach the MySQL server — it isn’t running, or the client is looking for the socket/port in the wrong place.

port is already allocatedDocker

Docker: Bind for 0.0.0.0:80 failed: port is already allocated

Another container or host process already publishes that host port.

ENOTFOUNDAPI

Error: getaddrinfo ENOTFOUND host / Name or service not known

DNS lookup for the hostname failed — the name is wrong, doesn’t exist, or this machine can’t resolve it.

ExpiredTokenAWS

AWS: ExpiredToken — The security token included in the request is expired

Temporary AWS credentials (STS/SSO/assumed role) have expired.

401HTTP

HTTP 401 Unauthorized

The request has no valid authentication credentials — you need to log in or send a valid token.

session_start()PHP

Warning: session_start(): Session cannot be started after headers have already been sent

session_start() ran after output was sent, so PHP can’t set the session cookie.

invalid_grantAuthentication

OAuth 2.0 Error: invalid_grant

The authorization code, refresh token or credentials sent to the token endpoint are invalid, expired, already used or were issued…

invalid_clientAuthentication

OAuth 2.0 Error: invalid_client

The OAuth server couldn’t authenticate your application — wrong client ID/secret, wrong auth method, or the client doesn’t exist…

clipboard write blockedJavaScript

NotAllowedError: Failed to execute 'writeText' on 'Clipboard': Document is not focused.

The Clipboard API refused to write — the page isn’t focused, there was no user gesture, or the context isn’t secure.

dpkg lockLinux

E: Could not get lock /var/lib/dpkg/lock-frontend — is another process using it?

apt can’t run because another package operation (often automatic updates) holds the dpkg lock.

UNPROTECTED PRIVATE KEY FILELinux

WARNING: UNPROTECTED PRIVATE KEY FILE! Permissions 0644 for 'key.pem' are too open

SSH refuses to use a private key that other users can read; it must be readable only by you (chmod 600).

sudo: unable to resolve hostLinux

sudo: unable to resolve host <hostname>: Name or service not known

The machine’s hostname isn’t in /etc/hosts (or DNS), so sudo prints this warning — usually after changing the hostname.

StringIndexOutOfBoundsExceptionJava

java.lang.StringIndexOutOfBoundsException: begin 0, end 10, length 5

substring()/charAt() used an index outside the string.

ArithmeticExceptionJava

java.lang.ArithmeticException: / by zero

Integer division or modulo by zero.

UnsupportedOperationExceptionJava

java.lang.UnsupportedOperationException (List.of / Arrays.asList is immutable)

Code tried to modify an immutable or fixed-size collection.

EADDRINUSENode.js

Error: listen EADDRINUSE: address already in use :::3000

Another process is already listening on that port.

EPERMNode.js

Error: EPERM: operation not permitted, rename / unlink

The OS refused a file operation — on Windows usually because another process (antivirus, editor, indexer) has the file locked.

Unhandled 'error' eventNode.js

Error: Unhandled 'error' event (events.js / node:events)

An EventEmitter (stream, socket, child process, server) emitted 'error' and nothing listened for it, so Node crashed.

AuthorizationFailedAzure

Azure: AuthorizationFailed — The client does not have authorization to perform action

The signed-in identity (user, service principal or managed identity) lacks an Azure RBAC role for that action on that scope.

AuthorizationPermissionMismatchAzure

Azure Storage: AuthorizationPermissionMismatch (403) — This request is not authorized to perform this operation using this permission

You’re accessing blob/queue data with Microsoft Entra ID, but the identity has only management roles (Owner/Contributor) — not a…

spawn EACCESNode.js

Error: spawn EACCES

Node tried to execute a file that isn’t executable (missing +x permission) or isn’t a program.

webhook signatureAPI

Webhook signature verification failed (Stripe, Razorpay, GitHub…)

Your endpoint computed a different HMAC signature than the one the provider sent, so the webhook is rejected.

violates PodSecurityKubernetes

Error creating: pods is forbidden: violates PodSecurity "restricted:latest": allowPrivilegeEscalation != false ...

The namespace enforces a Pod Security Standard (baseline/restricted) and the pod spec breaks one of its rules.

REMOTE HOST IDENTIFICATION HAS CHANGEDLinux

WARNING: REMOTE HOST IDENTIFICATION HAS CHANGED! (ssh host key changed)

The server’s SSH host key differs from the one saved in ~/.ssh/known_hosts — usually because the server was rebuilt or the IP was…

ENOENTNode.js

Error: ENOENT: no such file or directory

A file or directory the program tried to open doesn’t exist at that path.

FileNotFoundExceptionJava

java.io.FileNotFoundException: config.properties (No such file or directory)

Java couldn’t open the file — wrong path relative to the working directory, missing file, or a classpath resource read as a file.

NoSuchFileExceptionJava

java.nio.file.NoSuchFileException: /path/file

An NIO Files operation targeted a path that doesn’t exist.