Error map

22003 ERROR: numeric field overflow — A field with precision 5, scale 2 must round to an absolute value less than 10^3

PostgreSQL · layer 5, Data

Open the full error page →

Centre: this error. First ring: errors it is linked with (9). Outer ring: what those are linked with. Colours show the layer of a request each error belongs to. Click any dot to re-centre the map on it; hover to follow its connections. The centre dot opens the error page.

22003 — ERROR: numeric field overflow — A field with precision 5, scale 2 must round to an absolute value less than 10^3 (PostgreSQL)2200322P02 uuid — ERROR: invalid input syntax for type uuid: "x" (PostgreSQL)22P02 uuid8115 — SQL Server: Arithmetic overflow error converting expression to data type int. (Msg 8115) (SQL)811522P02 — ERROR: invalid input syntax for type integer: "abc" (PostgreSQL)22P02invalid_type — API Error: Invalid type — expected integer, received string (API)invalid_type22008 — ERROR: date/time field value out of range: "31/12/2024" — HINT: Perhaps you need a different "datestyle" setting. (PostgreSQL)2200842804 — ERROR: column "x" is of type integer but expression is of type text — HINT: You will need to rewrite or cast the expression. (PostgreSQL)4280442883 operator — ERROR: operator does not exist: integer = text (PostgreSQL)42883 operator1264 — MySQL ERROR 1264 (22003): Out of range value for column 'x' at row 1 (MySQL)1264malformed array literal — ERROR: malformed array literal: "x" (PostgreSQL)malformed array lit…1366 — MySQL ERROR 1366 (HY000): Incorrect integer value: '' for column 'x' at row 1 (MySQL)1366CastError ObjectId — CastError: Cast to ObjectId failed for value "x" (type string) at path "_id" (Node.js)CastError ObjectId23502 — ERROR: null value in column "x" of relation "y" violates not-null constraint (PostgreSQL)2350218456 — SQL Server: Login failed for user 'x'. (Error 18456) (SQL)18456208 — SQL Server: Invalid object name 'x'. (Msg 208) (SQL)208207 — SQL Server: Invalid column name 'x'. (Msg 207) (SQL)2071690 — MySQL ERROR 1690 (22003): BIGINT UNSIGNED value is out of range (MySQL)169023514 — ERROR: new row for relation "x" violates check constraint "y" (PostgreSQL)2351422001 — ERROR: value too long for type character varying(255) (PostgreSQL)22001400 — HTTP 400 Bad Request (HTTP)400422 — HTTP 422 Unprocessable Content (HTTP)4221406 — MySQL ERROR 1406: Data too long for column (MySQL)1406DateTimeParseException — java.time.format.DateTimeParseException: Text '31/12/2024' could not be parsed at index 2 (Java)DateTimeParseExcept…Unparseable date — java.text.ParseException: Unparseable date: "x" (Java)Unparseable dateinvalid time value — RangeError: Invalid time value (JavaScript)invalid time value1093 — MySQL ERROR 1093 (HY000): You can't specify target table 'x' for update in FROM clause (MySQL)10931175 — MySQL ERROR 1175 (HY000): You are using safe update mode and you tried to update a table without a WHERE that uses a KEY column (MySQL)11751241 — MySQL ERROR 1241 (21000): Operand should contain 1 column(s) (MySQL)124108P01 — ERROR: bind message supplies 2 parameters, but prepared statement requires 1 (PostgreSQL)08P0142P18 — ERROR: could not determine data type of parameter $1 (PostgreSQL)42P18currval not defined — ERROR: currval of sequence "x" is not yet defined in this session (PostgreSQL)currval not defined1048 — MySQL ERROR 1048 (23000): Column 'x' cannot be null (MySQL)10481292 — MySQL ERROR 1292 (22007): Incorrect datetime value: 'x' for column 'y' (MySQL)1292Pydantic ValidationError — pydantic_core._pydantic_core.ValidationError: 1 validation error for Model (Python)Pydantic Validation…

Directly related (9)

22P02 uuidPostgreSQL

ERROR: invalid input syntax for type uuid: "x"

A value that isn’t a valid UUID was compared with or inserted into a uuid column.

8115SQL

SQL Server: Arithmetic overflow error converting expression to data type int. (Msg 8115)

A value or calculation exceeds the target data type’s range.

22P02PostgreSQL

ERROR: invalid input syntax for type integer: "abc"

A string couldn’t be converted to the column’s type (integer, numeric, boolean, date…).

invalid_typeAPI

API Error: Invalid type — expected integer, received string

A request field has the wrong data type — a string where the API expects a number, a number where it expects a boolean, an object…

22008PostgreSQL

ERROR: date/time field value out of range: "31/12/2024" — HINT: Perhaps you need a different "datestyle" setting.

PostgreSQL parsed a date in the wrong order (DMY vs MDY) or got an impossible value.

42804PostgreSQL

ERROR: column "x" is of type integer but expression is of type text — HINT: You will need to rewrite or cast the expression.

An INSERT/UPDATE supplies a value of a different type than the column, and PostgreSQL won’t cast implicitly.

42883 operatorPostgreSQL

ERROR: operator does not exist: integer = text

A comparison or operation mixes types PostgreSQL won’t implicitly convert.

1264MySQL

MySQL ERROR 1264 (22003): Out of range value for column 'x' at row 1

A number is too large (or negative for UNSIGNED) for the column type.

malformed array literalPostgreSQL

ERROR: malformed array literal: "x"

A value sent to an array column isn’t in PostgreSQL array syntax ({a,b}).

Two steps away (24)

1366MySQL

MySQL ERROR 1366 (HY000): Incorrect integer value: '' for column 'x' at row 1

An empty string or non-numeric text was inserted into an INT column under strict mode.

CastError ObjectIdNode.js

CastError: Cast to ObjectId failed for value "x" (type string) at path "_id"

A value that isn’t a valid 24-hex-character ObjectId was used in an _id query.

23502PostgreSQL

ERROR: null value in column "x" of relation "y" violates not-null constraint

An INSERT/UPDATE put NULL into a NOT NULL column.

18456SQL

SQL Server: Login failed for user 'x'. (Error 18456)

SQL Server rejected the login — wrong password, wrong authentication mode, or a disabled/missing login.

208SQL

SQL Server: Invalid object name 'x'. (Msg 208)

The table/view doesn’t exist in the current database or schema.

207SQL

SQL Server: Invalid column name 'x'. (Msg 207)

SQL Server can’t find the column — typo, missing migration, or a string in double quotes with QUOTED_IDENTIFIER ON.

1690MySQL

MySQL ERROR 1690 (22003): BIGINT UNSIGNED value is out of range

Arithmetic on UNSIGNED columns produced a negative result.

23514PostgreSQL

ERROR: new row for relation "x" violates check constraint "y"

A value failed a CHECK constraint (e.g. price > 0, status IN (…)).

22001PostgreSQL

ERROR: value too long for type character varying(255)

A string exceeds the column’s varchar length.

400HTTP

HTTP 400 Bad Request

The server could not understand the request because its syntax, headers or body are malformed or invalid.

422HTTP

HTTP 422 Unprocessable Content

The request is well-formed, but the data fails validation (e.g. invalid email, missing required field).

1406MySQL

MySQL ERROR 1406: Data too long for column

The value is longer than the column allows (e.g. 300 characters into VARCHAR(255)), and strict mode rejects it instead of truncat…

DateTimeParseExceptionJava

java.time.format.DateTimeParseException: Text '31/12/2024' could not be parsed at index 2

A java.time parse call got text that doesn’t match the expected format.

Unparseable dateJava

java.text.ParseException: Unparseable date: "x"

SimpleDateFormat couldn’t parse the string with its pattern.

invalid time valueJavaScript

RangeError: Invalid time value

A Date is invalid (NaN), and toISOString() or a formatting library couldn’t format it.

1093MySQL

MySQL ERROR 1093 (HY000): You can't specify target table 'x' for update in FROM clause

An UPDATE/DELETE uses a subquery that reads from the same table, which MySQL doesn’t allow directly.

1175MySQL

MySQL ERROR 1175 (HY000): You are using safe update mode and you tried to update a table without a WHERE that uses a KEY column

MySQL Workbench’s safe updates mode blocked an UPDATE/DELETE without a key-based WHERE.

1241MySQL

MySQL ERROR 1241 (21000): Operand should contain 1 column(s)

A subquery or expression returned several columns where only one is expected.

08P01PostgreSQL

ERROR: bind message supplies 2 parameters, but prepared statement requires 1

The number of query parameters sent doesn’t match the $1, $2 … placeholders in the SQL.

42P18PostgreSQL

ERROR: could not determine data type of parameter $1

PostgreSQL can’t infer a parameter’s type from context (e.g. $1 IS NULL or SELECT $1).

currval not definedPostgreSQL

ERROR: currval of sequence "x" is not yet defined in this session

currval() was called before nextval() in the same session.

1048MySQL

MySQL ERROR 1048 (23000): Column 'x' cannot be null

An INSERT/UPDATE put NULL into a NOT NULL column.

1292MySQL

MySQL ERROR 1292 (22007): Incorrect datetime value: 'x' for column 'y'

A string couldn’t be converted to DATE/DATETIME — wrong format, empty string, or a zero date in strict mode.

Pydantic ValidationErrorPython

pydantic_core._pydantic_core.ValidationError: 1 validation error for Model

Data didn’t match a Pydantic model — a field is missing, has the wrong type, or fails a constraint.