Error map
undefined reference to vtable C++: undefined reference to `vtable for X' — virtual function not defined
C/C++ · layer 4, Application & API
Centre: this error. First ring: errors it is linked with (7). Outer ring: what those are linked with. Colours show the layer of a request each error belongs to. Click any dot to re-centre the map on it; hover to follow its connections. The centre dot opens the error page.
Directly related (7)
C/C++: undefined reference to `function' — collect2: error: ld returned 1 exit status
The linker can’t find the definition of a function or variable that was declared and used.
C++: error: cannot declare variable 'x' to be of abstract type 'Shape' (pure virtual functions)
You tried to create an object of a class that still has pure virtual functions; only a derived class that overrides all of them c…
C/C++: multiple definition of `x'; first defined here — ld returned 1 exit status
The linker found the same function or global variable defined in two object files — usually something defined in a header.
C/C++: undefined reference to `main' — (.text+0x20) in crt1.o
The linker has no `main` function: the file with `main` is not compiled or linked, or `main` is spelled or declared incorrectly.
C/C++: undefined reference to `pthread_create' — missing -pthread (also `dlopen`, `clock_gettime`)
Your program uses threads (or another system library) but the linker was not told to link it.
C++: pure virtual method called — terminate called without an active exception
A pure virtual function was called on an object that is being constructed or destroyed, where the derived part no longer exists.
MSVC: fatal error LNK1104: cannot open file 'foo.lib' (or 'app.exe' while it is running)
The Visual C++ linker could not open an input library or the output file — the path is wrong, the library is missing, or the .exe…
Two steps away (19)
npm ERR! code ELIFECYCLE / Command failed with exit code 1
An npm script (build, start, test, postinstall) exited with an error. ELIFECYCLE is only the wrapper — the real error is printed…
gyp ERR! build error / node-gyp rebuild failed
A dependency with native C/C++ code couldn’t compile — missing build tools, Python, or an unsupported Node version.
COPY failed: file not found in build context / "/app/x": not found
The Dockerfile COPY refers to a path outside the build context, excluded by .dockerignore, or relative to the wrong directory.
C++: error: no match for 'operator<<' (operand types are 'std::ostream' and 'X')
You used an operator on a type that does not define it — most often printing your own class with `
C++: error: use of deleted function 'X::X(const X&)' — copying a non-copyable type
The code needs a function (usually a copy constructor or assignment) that was deleted explicitly or implicitly, as for `std::uniq…
C++: error: no matching function for call to 'f(int, const char*)'
No overload of the function accepts the arguments you passed — wrong count, wrong types, or a missing conversion.
C++: error: redefinition of 'class X' / multiple definition — missing include guard
The same class, struct or function body was included twice in one translation unit because the header has no include guard.
C++: error: invalid use of incomplete type 'class X' — forward declaration only
You used a class that has only been forward-declared (so its size and members are unknown) where the full definition is required.
C: warning: implicit declaration of function 'foo' [-Wimplicit-function-declaration]
In C you called a function the compiler has not seen declared — usually a missing `#include`. Newer compilers treat it as an erro…
C/C++: fatal error: foo.h: No such file or directory — #include not found
The preprocessor cannot find a header named in `#include`: wrong path, missing include directory (-I), or the library is not inst…
Make: *** No rule to make target 'foo.c', needed by 'foo.o'. Stop.
`make` was asked to build a file for which there is no rule and no existing file — a missing source, a typo in the Makefile, or a…
Make: Makefile:5: *** missing separator. Stop. (spaces instead of a tab)
A line in the Makefile is neither a rule, a variable assignment nor a tab-indented command — nearly always spaces used where a TA…
error while loading shared libraries: libX.so.N: cannot open shared object file: No such file or directory
The program needs a shared library (.so) that isn’t installed or isn’t on the loader’s search path.
C++: terminate called without an active exception — std::thread destroyed while joinable
A `std::thread` object was destroyed (or reassigned) while its thread was still running, so the C++ runtime called `std::terminat…
C++: error: call of overloaded 'f(int)' is ambiguous
Two or more overloads fit equally well, so the compiler refuses to guess which function you meant.
C/C++: Assertion `x > 0' failed. Aborted (core dumped) — assert() condition was false
An `assert()` in your code or in a library found its condition false and aborted the program on purpose.
C/C++: ==ERROR: AddressSanitizer: heap-buffer-overflow on address — READ/WRITE of size N
AddressSanitizer caught a read or write just outside a heap block — an array index or length that is off by one or more.
MSVC: error C4996: 'strcpy': This function or variable may be unsafe. Consider using strcpy_s instead
Visual C++ treats classic C library functions such as `strcpy`, `sprintf`, `fopen` and `scanf` as deprecated or unsafe and, with…
MSVC: error C2065: 'x': undeclared identifier
Visual C++ met a name it has not seen declared — a typo, a missing header or namespace, or use outside its scope.
Map another error
Popular: 4035004000xC000007BTypeErrorCritical error404NullPointerException