Error map

C4996 MSVC: error C4996: 'strcpy': This function or variable may be unsafe. Consider using strcpy_s instead

C/C++ · layer 4, Application & API

Open the full error page →

Centre: this error. First ring: errors it is linked with (7). Outer ring: what those are linked with. Colours show the layer of a request each error belongs to. Click any dot to re-centre the map on it; hover to follow its connections. The centre dot opens the error page.

C4996 — MSVC: error C4996: 'strcpy': This function or variable may be unsafe. Consider using strcpy_s instead (C/C++)C4996control reaches end of non-void function — C/C++: warning: control reaches end of non-void function [-Wreturn-type] (C/C++)control reaches end…comparison of integers of different signs — C/C++: warning: comparison of integer expressions of different signedness: 'int' and 'size_t' [-Wsign-compare] (C/C++)comparison of integ…format expects argument of type — C: warning: format '%d' expects argument of type 'int', but argument 2 has type 'long int' [-Wformat=] (C/C++)format expects argu…implicit declaration of function — C: warning: implicit declaration of function 'foo' [-Wimplicit-function-declaration] (C/C++)implicit declaratio…stack smashing detected — C/C++: *** stack smashing detected ***: terminated — buffer overflow on the stack (C/C++)stack smashing dete…LNK1104 — MSVC: fatal error LNK1104: cannot open file 'foo.lib' (or 'app.exe' while it is running) (C/C++)LNK1104C2065 — MSVC: error C2065: 'x': undeclared identifier (C/C++)C2065cannot declare variable to be of abstract type — C++: error: cannot declare variable 'x' to be of abstract type 'Shape' (pure virtual functions) (C/C++)cannot declare vari…Segmentation fault — C/C++: Segmentation fault (core dumped) — SIGSEGV from a null, dangling or out-of-bounds pointer (C/C++)Segmentation faultruntime error: — C/C++: runtime error: signed integer overflow / null pointer / shift exponent too large (UndefinedBehaviorSanitizer) (C/C++)runtime error:invalid conversion from — C++: error: invalid conversion from 'const char*' to 'char*' [-fpermissive] (C/C++)invalid conversion …does not name a type — C++: error: 'string' does not name a type (C/C++)does not name a typecall of overloaded is ambiguous — C++: error: call of overloaded 'f(int)' is ambiguous (C/C++)call of overloaded …undefined reference to — C/C++: undefined reference to `function' — collect2: error: ld returned 1 exit status (C/C++)undefined reference…was not declared in this scope — C++: error: 'x' was not declared in this scope (undeclared identifier) (C/C++)was not declared in…redefinition of — C++: error: redefinition of 'class X' / multiple definition — missing include guard (C/C++)redefinition ofdouble free or corruption — C/C++: free(): double free detected / double free or corruption (out) — Aborted (core dumped) (C/C++)double free or corr…stack overflow — C/C++: stack overflow — infinite recursion or huge local array (Segmentation fault, 0xC00000FD) (C/C++)stack overflowFloating point exception — C/C++: Floating point exception (core dumped) — SIGFPE, usually integer division by zero (C/C++)Floating point exce…multiple definition of — C/C++: multiple definition of `x'; first defined here — ld returned 1 exit status (C/C++)multiple definition…undefined reference to vtable — C++: undefined reference to `vtable for X' — virtual function not defined (C/C++)undefined reference…undefined reference to main — C/C++: undefined reference to `main' — (.text+0x20) in crt1.o (C/C++)undefined reference…AddressSanitizer: heap-buffer-overflow — C/C++: ==ERROR: AddressSanitizer: heap-buffer-overflow on address — READ/WRITE of size N (C/C++)AddressSanitizer: h…AddressSanitizer: heap-use-after-free — C/C++: ==ERROR: AddressSanitizer: heap-use-after-free on address — memory used after delete/free (C/C++)AddressSanitizer: h…

Directly related (7)

control reaches end of non-void functionC/C++

C/C++: warning: control reaches end of non-void function [-Wreturn-type]

A function that promises a return value can finish without returning one on some path — undefined behaviour in C++.

comparison of integers of different signsC/C++

C/C++: warning: comparison of integer expressions of different signedness: 'int' and 'size_t' [-Wsign-compare]

A signed integer is compared with an unsigned one; the signed value is converted to unsigned, so a negative number becomes huge.

format expects argument of typeC/C++

C: warning: format '%d' expects argument of type 'int', but argument 2 has type 'long int' [-Wformat=]

The `printf`/`scanf` format specifier does not match the argument's type, which is undefined behaviour and prints garbage or cras…

implicit declaration of functionC/C++

C: warning: implicit declaration of function 'foo' [-Wimplicit-function-declaration]

In C you called a function the compiler has not seen declared — usually a missing `#include`. Newer compilers treat it as an erro…

stack smashing detectedC/C++

C/C++: *** stack smashing detected ***: terminated — buffer overflow on the stack

GCC's stack protector noticed that a local buffer overflowed and overwrote the function's canary value, so it aborted the program.

LNK1104C/C++

MSVC: fatal error LNK1104: cannot open file 'foo.lib' (or 'app.exe' while it is running)

The Visual C++ linker could not open an input library or the output file — the path is wrong, the library is missing, or the .exe…

C2065C/C++

MSVC: error C2065: 'x': undeclared identifier

Visual C++ met a name it has not seen declared — a typo, a missing header or namespace, or use outside its scope.

Two steps away (17)

cannot declare variable to be of abstract typeC/C++

C++: error: cannot declare variable 'x' to be of abstract type 'Shape' (pure virtual functions)

You tried to create an object of a class that still has pure virtual functions; only a derived class that overrides all of them c…

Segmentation faultC/C++

C/C++: Segmentation fault (core dumped) — SIGSEGV from a null, dangling or out-of-bounds pointer

The program touched memory it is not allowed to access — a null or dangling pointer, an out-of-range array index, or a stack over…

runtime error:C/C++

C/C++: runtime error: signed integer overflow / null pointer / shift exponent too large (UndefinedBehaviorSanitizer)

UBSan detected code that triggers undefined behaviour (overflow, null dereference, out-of-bounds index, bad shift, misaligned acc…

invalid conversion fromC/C++

C++: error: invalid conversion from 'const char*' to 'char*' [-fpermissive]

C++ forbids silently dropping `const` or converting between unrelated pointer types — typically a string literal assigned to `cha…

does not name a typeC/C++

C++: error: 'string' does not name a type

Where the compiler expected a type, it found a name it does not know as one — a missing header, namespace, or class declared late…

call of overloaded is ambiguousC/C++

C++: error: call of overloaded 'f(int)' is ambiguous

Two or more overloads fit equally well, so the compiler refuses to guess which function you meant.

undefined reference toC/C++

C/C++: undefined reference to `function' — collect2: error: ld returned 1 exit status

The linker can’t find the definition of a function or variable that was declared and used.

was not declared in this scopeC/C++

C++: error: 'x' was not declared in this scope (undeclared identifier)

The compiler met a name it has never seen: it is misspelled, declared later, out of scope, or its header or namespace is missing.

redefinition ofC/C++

C++: error: redefinition of 'class X' / multiple definition — missing include guard

The same class, struct or function body was included twice in one translation unit because the header has no include guard.

double free or corruptionC/C++

C/C++: free(): double free detected / double free or corruption (out) — Aborted (core dumped)

Memory was freed twice or the heap was corrupted (buffer overflow, freeing a non-heap pointer), so glibc aborted the program.

stack overflowC/C++

C/C++: stack overflow — infinite recursion or huge local array (Segmentation fault, 0xC00000FD)

The call stack ran out of space, typically from recursion that never stops or from a very large array declared as a local variabl…

Floating point exceptionC/C++

C/C++: Floating point exception (core dumped) — SIGFPE, usually integer division by zero

Despite the name, this is almost always an integer division or modulo by zero (or INT_MIN / -1); floating-point division by zero…

multiple definition ofC/C++

C/C++: multiple definition of `x'; first defined here — ld returned 1 exit status

The linker found the same function or global variable defined in two object files — usually something defined in a header.

undefined reference to vtableC/C++

C++: undefined reference to `vtable for X' — virtual function not defined

The linker cannot find the class's virtual table, which means at least one virtual member function was declared but never defined…

undefined reference to mainC/C++

C/C++: undefined reference to `main' — (.text+0x20) in crt1.o

The linker has no `main` function: the file with `main` is not compiled or linked, or `main` is spelled or declared incorrectly.

AddressSanitizer: heap-buffer-overflowC/C++

C/C++: ==ERROR: AddressSanitizer: heap-buffer-overflow on address — READ/WRITE of size N

AddressSanitizer caught a read or write just outside a heap block — an array index or length that is off by one or more.

AddressSanitizer: heap-use-after-freeC/C++

C/C++: ==ERROR: AddressSanitizer: heap-use-after-free on address — memory used after delete/free

The program read or wrote a heap block after it had been freed; ASan shows who freed it and where it was allocated.