Error map

was not declared in this scope C++: error: 'x' was not declared in this scope (undeclared identifier)

C/C++ · layer 4, Application & API

Open the full error page →

Centre: this error. First ring: errors it is linked with (10). Outer ring: what those are linked with. Colours show the layer of a request each error belongs to. Click any dot to re-centre the map on it; hover to follow its connections. The centre dot opens the error page.

was not declared in this scope — C++: error: 'x' was not declared in this scope (undeclared identifier) (C/C++)was not dec…undefined reference to — C/C++: undefined reference to `function' — collect2: error: ld returned 1 exit status (C/C++)undefined reference…expected ';' before — C/C++: error: expected ';' before 'x' — missing semicolon (C/C++)expected ';' beforeexpected primary-expression before — C++: error: expected primary-expression before ')' token (C/C++)expected primary-ex…does not name a type — C++: error: 'string' does not name a type (C/C++)does not name a typeneed typename before dependent name — C++: error: need 'typename' before 'T::iterator' because 'T' is a dependent scope (C/C++)need typename befor…stray in program — C/C++: error: stray '\342' in program (smart quotes or invisible characters) (C/C++)stray in programexpected unqualified-id before — C++: error: expected unqualified-id before 'return' / before ')' token (C/C++)expected unqualifie…not a member of std — C++: error: 'optional' in namespace 'std' does not name a template type — wrong -std standard (C/C++)not a member of stdimplicit declaration of function — C: warning: implicit declaration of function 'foo' [-Wimplicit-function-declaration] (C/C++)implicit declaratio…C2065 — MSVC: error C2065: 'x': undeclared identifier (C/C++)C2065ELIFECYCLE — npm ERR! code ELIFECYCLE / Command failed with exit code 1 (npm)ELIFECYCLEgyp ERR! — gyp ERR! build error / node-gyp rebuild failed (npm)gyp ERR!COPY failed — COPY failed: file not found in build context / "/app/x": not found (Docker)COPY faileddeclared and not used — Go: declared and not used: x / "fmt" imported and not used (Go)declared and not us…E0308 — Rust: error[E0308]: mismatched types — expected `X`, found `Y` (Rust)E0308no matching function for call to — C++: error: no matching function for call to 'f(int, const char*)' (C/C++)no matching functio…invalid conversion from — C++: error: invalid conversion from 'const char*' to 'char*' [-fpermissive] (C/C++)invalid conversion …incomplete type — C++: error: invalid use of incomplete type 'class X' — forward declaration only (C/C++)incomplete typecall of overloaded is ambiguous — C++: error: call of overloaded 'f(int)' is ambiguous (C/C++)call of overloaded …no match for 'operator' — C++: error: no match for 'operator<<' (operand types are 'std::ostream' and 'X') (C/C++)no match for 'opera…template argument deduction/substitution failed — C++: error: template argument deduction/substitution failed / couldn't deduce template parameter (C/C++)template argument d…cannot declare variable to be of abstract type — C++: error: cannot declare variable 'x' to be of abstract type 'Shape' (pure virtual functions) (C/C++)cannot declare vari…fatal error: No such file or directory — C/C++: fatal error: foo.h: No such file or directory — #include not found (C/C++)fatal error: No suc…redefinition of — C++: error: redefinition of 'class X' / multiple definition — missing include guard (C/C++)redefinition ofNo rule to make target — Make: *** No rule to make target 'foo.c', needed by 'foo.o'. Stop. (C/C++)No rule to make tar…control reaches end of non-void function — C/C++: warning: control reaches end of non-void function [-Wreturn-type] (C/C++)control reaches end…comparison of integers of different signs — C/C++: warning: comparison of integer expressions of different signedness: 'int' and 'size_t' [-Wsign-compare] (C/C++)comparison of integ…format expects argument of type — C: warning: format '%d' expects argument of type 'int', but argument 2 has type 'long int' [-Wformat=] (C/C++)format expects argu…AddressSanitizer: heap-buffer-overflow — C/C++: ==ERROR: AddressSanitizer: heap-buffer-overflow on address — READ/WRITE of size N (C/C++)AddressSanitizer: h…AddressSanitizer: heap-use-after-free — C/C++: ==ERROR: AddressSanitizer: heap-use-after-free on address — memory used after delete/free (C/C++)AddressSanitizer: h…C4996 — MSVC: error C4996: 'strcpy': This function or variable may be unsafe. Consider using strcpy_s instead (C/C++)C4996

Directly related (10)

undefined reference toC/C++

C/C++: undefined reference to `function' — collect2: error: ld returned 1 exit status

The linker can’t find the definition of a function or variable that was declared and used.

expected ';' beforeC/C++

C/C++: error: expected ';' before 'x' — missing semicolon

The compiler reached a token where a statement should have ended — almost always a missing semicolon on the line above.

expected primary-expression beforeC/C++

C++: error: expected primary-expression before ')' token

The parser expected a value or expression and found a token that cannot start one — often a type name passed where a value belong…

does not name a typeC/C++

C++: error: 'string' does not name a type

Where the compiler expected a type, it found a name it does not know as one — a missing header, namespace, or class declared late…

need typename before dependent nameC/C++

C++: error: need 'typename' before 'T::iterator' because 'T' is a dependent scope

Inside a template, a name like `T::iterator` could be a type or a value, so C++ requires the `typename` keyword to say it is a ty…

stray in programC/C++

C/C++: error: stray '\342' in program (smart quotes or invisible characters)

The source file contains a character the compiler does not recognise, typically curly quotes or a non-breaking space pasted from…

expected unqualified-id beforeC/C++

C++: error: expected unqualified-id before 'return' / before ')' token

The parser found a token where a name (declaration) was required — often a missing brace, a stray `)`, or a statement placed in a…

not a member of stdC/C++

C++: error: 'optional' in namespace 'std' does not name a template type — wrong -std standard

The standard-library feature you used needs a newer C++ standard than the compiler is currently set to.

implicit declaration of functionC/C++

C: warning: implicit declaration of function 'foo' [-Wimplicit-function-declaration]

In C you called a function the compiler has not seen declared — usually a missing `#include`. Newer compilers treat it as an erro…

C2065C/C++

MSVC: error C2065: 'x': undeclared identifier

Visual C++ met a name it has not seen declared — a typo, a missing header or namespace, or use outside its scope.

Two steps away (21)

ELIFECYCLEnpm

npm ERR! code ELIFECYCLE / Command failed with exit code 1

An npm script (build, start, test, postinstall) exited with an error. ELIFECYCLE is only the wrapper — the real error is printed…

gyp ERR!npm

gyp ERR! build error / node-gyp rebuild failed

A dependency with native C/C++ code couldn’t compile — missing build tools, Python, or an unsupported Node version.

COPY failedDocker

COPY failed: file not found in build context / "/app/x": not found

The Dockerfile COPY refers to a path outside the build context, excluded by .dockerignore, or relative to the wrong directory.

declared and not usedGo

Go: declared and not used: x / "fmt" imported and not used

Go refuses to compile code with unused local variables or unused imports.

E0308Rust

Rust: error[E0308]: mismatched types — expected `X`, found `Y`

A value’s type doesn’t match what the context expects — common with &str vs String, Option/Result vs plain values, and integer ty…

no matching function for call toC/C++

C++: error: no matching function for call to 'f(int, const char*)'

No overload of the function accepts the arguments you passed — wrong count, wrong types, or a missing conversion.

invalid conversion fromC/C++

C++: error: invalid conversion from 'const char*' to 'char*' [-fpermissive]

C++ forbids silently dropping `const` or converting between unrelated pointer types — typically a string literal assigned to `cha…

incomplete typeC/C++

C++: error: invalid use of incomplete type 'class X' — forward declaration only

You used a class that has only been forward-declared (so its size and members are unknown) where the full definition is required.

call of overloaded is ambiguousC/C++

C++: error: call of overloaded 'f(int)' is ambiguous

Two or more overloads fit equally well, so the compiler refuses to guess which function you meant.

no match for 'operator'C/C++

C++: error: no match for 'operator<<' (operand types are 'std::ostream' and 'X')

You used an operator on a type that does not define it — most often printing your own class with `

template argument deduction/substitution failedC/C++

C++: error: template argument deduction/substitution failed / couldn't deduce template parameter

The compiler could not work out the template arguments from your call — the arguments disagree, the type can't be deduced, or a c…

cannot declare variable to be of abstract typeC/C++

C++: error: cannot declare variable 'x' to be of abstract type 'Shape' (pure virtual functions)

You tried to create an object of a class that still has pure virtual functions; only a derived class that overrides all of them c…

fatal error: No such file or directoryC/C++

C/C++: fatal error: foo.h: No such file or directory — #include not found

The preprocessor cannot find a header named in `#include`: wrong path, missing include directory (-I), or the library is not inst…

redefinition ofC/C++

C++: error: redefinition of 'class X' / multiple definition — missing include guard

The same class, struct or function body was included twice in one translation unit because the header has no include guard.

No rule to make targetC/C++

Make: *** No rule to make target 'foo.c', needed by 'foo.o'. Stop.

`make` was asked to build a file for which there is no rule and no existing file — a missing source, a typo in the Makefile, or a…

control reaches end of non-void functionC/C++

C/C++: warning: control reaches end of non-void function [-Wreturn-type]

A function that promises a return value can finish without returning one on some path — undefined behaviour in C++.

comparison of integers of different signsC/C++

C/C++: warning: comparison of integer expressions of different signedness: 'int' and 'size_t' [-Wsign-compare]

A signed integer is compared with an unsigned one; the signed value is converted to unsigned, so a negative number becomes huge.

format expects argument of typeC/C++

C: warning: format '%d' expects argument of type 'int', but argument 2 has type 'long int' [-Wformat=]

The `printf`/`scanf` format specifier does not match the argument's type, which is undefined behaviour and prints garbage or cras…

AddressSanitizer: heap-buffer-overflowC/C++

C/C++: ==ERROR: AddressSanitizer: heap-buffer-overflow on address — READ/WRITE of size N

AddressSanitizer caught a read or write just outside a heap block — an array index or length that is off by one or more.

AddressSanitizer: heap-use-after-freeC/C++

C/C++: ==ERROR: AddressSanitizer: heap-use-after-free on address — memory used after delete/free

The program read or wrote a heap block after it had been freed; ASan shows who freed it and where it was allocated.

C4996C/C++

MSVC: error C4996: 'strcpy': This function or variable may be unsafe. Consider using strcpy_s instead

Visual C++ treats classic C library functions such as `strcpy`, `sprintf`, `fopen` and `scanf` as deprecated or unsafe and, with…