Error map

control reaches end of non-void function C/C++: warning: control reaches end of non-void function [-Wreturn-type]

C/C++ · layer 4, Application & API

Open the full error page →

Centre: this error. First ring: errors it is linked with (7). Outer ring: what those are linked with. Colours show the layer of a request each error belongs to. Click any dot to re-centre the map on it; hover to follow its connections. The centre dot opens the error page.

control reaches end of non-void function — C/C++: warning: control reaches end of non-void function [-Wreturn-type] (C/C++)control rea…cannot declare variable to be of abstract type — C++: error: cannot declare variable 'x' to be of abstract type 'Shape' (pure virtual functions) (C/C++)cannot declare vari…comparison of integers of different signs — C/C++: warning: comparison of integer expressions of different signedness: 'int' and 'size_t' [-Wsign-compare] (C/C++)comparison of integ…format expects argument of type — C: warning: format '%d' expects argument of type 'int', but argument 2 has type 'long int' [-Wformat=] (C/C++)format expects argu…implicit declaration of function — C: warning: implicit declaration of function 'foo' [-Wimplicit-function-declaration] (C/C++)implicit declaratio…Segmentation fault — C/C++: Segmentation fault (core dumped) — SIGSEGV from a null, dangling or out-of-bounds pointer (C/C++)Segmentation faultruntime error: — C/C++: runtime error: signed integer overflow / null pointer / shift exponent too large (UndefinedBehaviorSanitizer) (C/C++)runtime error:C4996 — MSVC: error C4996: 'strcpy': This function or variable may be unsafe. Consider using strcpy_s instead (C/C++)C4996no match for 'operator' — C++: error: no match for 'operator<<' (operand types are 'std::ostream' and 'X') (C/C++)no match for 'opera…use of deleted function — C++: error: use of deleted function 'X::X(const X&)' — copying a non-copyable type (C/C++)use of deleted func…no matching function for call to — C++: error: no matching function for call to 'f(int, const char*)' (C/C++)no matching functio…invalid conversion from — C++: error: invalid conversion from 'const char*' to 'char*' [-fpermissive] (C/C++)invalid conversion …does not name a type — C++: error: 'string' does not name a type (C/C++)does not name a typecall of overloaded is ambiguous — C++: error: call of overloaded 'f(int)' is ambiguous (C/C++)call of overloaded …stack smashing detected — C/C++: *** stack smashing detected ***: terminated — buffer overflow on the stack (C/C++)stack smashing dete…undefined reference to — C/C++: undefined reference to `function' — collect2: error: ld returned 1 exit status (C/C++)undefined reference…was not declared in this scope — C++: error: 'x' was not declared in this scope (undeclared identifier) (C/C++)was not declared in…redefinition of — C++: error: redefinition of 'class X' / multiple definition — missing include guard (C/C++)redefinition ofSIGSEGV — Segmentation fault (core dumped) (Linux)SIGSEGVdouble free or corruption — C/C++: free(): double free detected / double free or corruption (out) — Aborted (core dumped) (C/C++)double free or corr…Assertion failed — C/C++: Assertion `x > 0' failed. Aborted (core dumped) — assert() condition was false (C/C++)Assertion failednarrowing conversion — C++: error: narrowing conversion of 'x' from 'int' to 'char' inside { } [-Wnarrowing] (C/C++)narrowing conversionFloating point exception — C/C++: Floating point exception (core dumped) — SIGFPE, usually integer division by zero (C/C++)Floating point exce…AddressSanitizer: heap-buffer-overflow — C/C++: ==ERROR: AddressSanitizer: heap-buffer-overflow on address — READ/WRITE of size N (C/C++)AddressSanitizer: h…LNK1104 — MSVC: fatal error LNK1104: cannot open file 'foo.lib' (or 'app.exe' while it is running) (C/C++)LNK1104C2065 — MSVC: error C2065: 'x': undeclared identifier (C/C++)C2065

Directly related (7)

cannot declare variable to be of abstract typeC/C++

C++: error: cannot declare variable 'x' to be of abstract type 'Shape' (pure virtual functions)

You tried to create an object of a class that still has pure virtual functions; only a derived class that overrides all of them c…

comparison of integers of different signsC/C++

C/C++: warning: comparison of integer expressions of different signedness: 'int' and 'size_t' [-Wsign-compare]

A signed integer is compared with an unsigned one; the signed value is converted to unsigned, so a negative number becomes huge.

format expects argument of typeC/C++

C: warning: format '%d' expects argument of type 'int', but argument 2 has type 'long int' [-Wformat=]

The `printf`/`scanf` format specifier does not match the argument's type, which is undefined behaviour and prints garbage or cras…

implicit declaration of functionC/C++

C: warning: implicit declaration of function 'foo' [-Wimplicit-function-declaration]

In C you called a function the compiler has not seen declared — usually a missing `#include`. Newer compilers treat it as an erro…

Segmentation faultC/C++

C/C++: Segmentation fault (core dumped) — SIGSEGV from a null, dangling or out-of-bounds pointer

The program touched memory it is not allowed to access — a null or dangling pointer, an out-of-range array index, or a stack over…

runtime error:C/C++

C/C++: runtime error: signed integer overflow / null pointer / shift exponent too large (UndefinedBehaviorSanitizer)

UBSan detected code that triggers undefined behaviour (overflow, null dereference, out-of-bounds index, bad shift, misaligned acc…

C4996C/C++

MSVC: error C4996: 'strcpy': This function or variable may be unsafe. Consider using strcpy_s instead

Visual C++ treats classic C library functions such as `strcpy`, `sprintf`, `fopen` and `scanf` as deprecated or unsafe and, with…

Two steps away (18)

no match for 'operator'C/C++

C++: error: no match for 'operator<<' (operand types are 'std::ostream' and 'X')

You used an operator on a type that does not define it — most often printing your own class with `

use of deleted functionC/C++

C++: error: use of deleted function 'X::X(const X&)' — copying a non-copyable type

The code needs a function (usually a copy constructor or assignment) that was deleted explicitly or implicitly, as for `std::uniq…

no matching function for call toC/C++

C++: error: no matching function for call to 'f(int, const char*)'

No overload of the function accepts the arguments you passed — wrong count, wrong types, or a missing conversion.

invalid conversion fromC/C++

C++: error: invalid conversion from 'const char*' to 'char*' [-fpermissive]

C++ forbids silently dropping `const` or converting between unrelated pointer types — typically a string literal assigned to `cha…

does not name a typeC/C++

C++: error: 'string' does not name a type

Where the compiler expected a type, it found a name it does not know as one — a missing header, namespace, or class declared late…

call of overloaded is ambiguousC/C++

C++: error: call of overloaded 'f(int)' is ambiguous

Two or more overloads fit equally well, so the compiler refuses to guess which function you meant.

stack smashing detectedC/C++

C/C++: *** stack smashing detected ***: terminated — buffer overflow on the stack

GCC's stack protector noticed that a local buffer overflowed and overwrote the function's canary value, so it aborted the program.

undefined reference toC/C++

C/C++: undefined reference to `function' — collect2: error: ld returned 1 exit status

The linker can’t find the definition of a function or variable that was declared and used.

was not declared in this scopeC/C++

C++: error: 'x' was not declared in this scope (undeclared identifier)

The compiler met a name it has never seen: it is misspelled, declared later, out of scope, or its header or namespace is missing.

redefinition ofC/C++

C++: error: redefinition of 'class X' / multiple definition — missing include guard

The same class, struct or function body was included twice in one translation unit because the header has no include guard.

SIGSEGVLinux

Segmentation fault (core dumped)

A program accessed memory it wasn’t allowed to, and the kernel killed it with SIGSEGV (exit code 139).

double free or corruptionC/C++

C/C++: free(): double free detected / double free or corruption (out) — Aborted (core dumped)

Memory was freed twice or the heap was corrupted (buffer overflow, freeing a non-heap pointer), so glibc aborted the program.

Assertion failedC/C++

C/C++: Assertion `x > 0' failed. Aborted (core dumped) — assert() condition was false

An `assert()` in your code or in a library found its condition false and aborted the program on purpose.

narrowing conversionC/C++

C++: error: narrowing conversion of 'x' from 'int' to 'char' inside { } [-Wnarrowing]

Brace initialisation `{}` refuses conversions that can lose data, such as `double` to `int` or a runtime `int` to `char`.

Floating point exceptionC/C++

C/C++: Floating point exception (core dumped) — SIGFPE, usually integer division by zero

Despite the name, this is almost always an integer division or modulo by zero (or INT_MIN / -1); floating-point division by zero…

AddressSanitizer: heap-buffer-overflowC/C++

C/C++: ==ERROR: AddressSanitizer: heap-buffer-overflow on address — READ/WRITE of size N

AddressSanitizer caught a read or write just outside a heap block — an array index or length that is off by one or more.

LNK1104C/C++

MSVC: fatal error LNK1104: cannot open file 'foo.lib' (or 'app.exe' while it is running)

The Visual C++ linker could not open an input library or the output file — the path is wrong, the library is missing, or the .exe…

C2065C/C++

MSVC: error C2065: 'x': undeclared identifier

Visual C++ met a name it has not seen declared — a typo, a missing header or namespace, or use outside its scope.