Error map

Segmentation fault C/C++: Segmentation fault (core dumped) — SIGSEGV from a null, dangling or out-of-bounds pointer

C/C++ · layer 4, Application & API

Open the full error page →

Centre: this error. First ring: errors it is linked with (12). Outer ring: what those are linked with. Colours show the layer of a request each error belongs to. Click any dot to re-centre the map on it; hover to follow its connections. The centre dot opens the error page.

Segmentation fault — C/C++: Segmentation fault (core dumped) — SIGSEGV from a null, dangling or out-of-bounds pointer (C/C++)Segmentatio…SIGSEGV — Segmentation fault (core dumped) (Linux)SIGSEGVdouble free or corruption — C/C++: free(): double free detected / double free or corruption (out) — Aborted (core dumped) (C/C++)double free or corr…stack overflow — C/C++: stack overflow — infinite recursion or huge local array (Segmentation fault, 0xC00000FD) (C/C++)stack overflowcontrol reaches end of non-void function — C/C++: warning: control reaches end of non-void function [-Wreturn-type] (C/C++)control reaches end…implicit declaration of function — C: warning: implicit declaration of function 'foo' [-Wimplicit-function-declaration] (C/C++)implicit declaratio…Assertion failed — C/C++: Assertion `x > 0' failed. Aborted (core dumped) — assert() condition was false (C/C++)Assertion failedFloating point exception — C/C++: Floating point exception (core dumped) — SIGFPE, usually integer division by zero (C/C++)Floating point exce…Bus error — C/C++: Bus error (core dumped) — SIGBUS from misaligned access or a bad memory-mapped file (C/C++)Bus errorstack smashing detected — C/C++: *** stack smashing detected ***: terminated — buffer overflow on the stack (C/C++)stack smashing dete…std::bad_alloc — C++: terminate called after throwing an instance of 'std::bad_alloc' — what(): std::bad_alloc (C/C++)std::bad_allocAddressSanitizer: heap-buffer-overflow — C/C++: ==ERROR: AddressSanitizer: heap-buffer-overflow on address — READ/WRITE of size N (C/C++)AddressSanitizer: h…AddressSanitizer: heap-use-after-free — C/C++: ==ERROR: AddressSanitizer: heap-use-after-free on address — memory used after delete/free (C/C++)AddressSanitizer: h…CrashLoopBackOff — Kubernetes: CrashLoopBackOff (Kubernetes)CrashLoopBackOffRangeError — RangeError: Maximum call stack size exceeded (JavaScript)RangeErrorOOM killer — Killed / Out of memory: Killed process (Linux OOM killer) (Linux)OOM killerOOMKilled — Kubernetes: OOMKilled (exit code 137) (Kubernetes)OOMKilledOutOfMemoryError — java.lang.OutOfMemoryError: Java heap space (Java)OutOfMemoryErrorMEMORY_MANAGEMENT — Blue Screen: MEMORY_MANAGEMENT (Stop code 0x0000001A) (Windows)MEMORY_MANAGEMENTLeakSanitizer: detected memory leaks — C/C++: ==ERROR: LeakSanitizer: detected memory leaks — Direct leak of N byte(s) (C/C++)LeakSanitizer: dete…cannot declare variable to be of abstract type — C++: error: cannot declare variable 'x' to be of abstract type 'Shape' (pure virtual functions) (C/C++)cannot declare vari…comparison of integers of different signs — C/C++: warning: comparison of integer expressions of different signedness: 'int' and 'size_t' [-Wsign-compare] (C/C++)comparison of integ…format expects argument of type — C: warning: format '%d' expects argument of type 'int', but argument 2 has type 'long int' [-Wformat=] (C/C++)format expects argu…undefined reference to — C/C++: undefined reference to `function' — collect2: error: ld returned 1 exit status (C/C++)undefined reference…was not declared in this scope — C++: error: 'x' was not declared in this scope (undeclared identifier) (C/C++)was not declared in…redefinition of — C++: error: redefinition of 'class X' / multiple definition — missing include guard (C/C++)redefinition ofterminate called after throwing an instance of — C++: terminate called after throwing an instance of 'std::out_of_range' — what(): vector::_M_range_check (C/C++)terminate called af…call of overloaded is ambiguous — C++: error: call of overloaded 'f(int)' is ambiguous (C/C++)call of overloaded …pure virtual method called — C++: pure virtual method called — terminate called without an active exception (C/C++)pure virtual method…runtime error: — C/C++: runtime error: signed integer overflow / null pointer / shift exponent too large (UndefinedBehaviorSanitizer) (C/C++)runtime error:Cannot allocate memory — fork: Cannot allocate memory / ENOMEM (Linux)Cannot allocate mem…0xC0000005 — The application was unable to start correctly (0xc0000005) / Exception code 0xc0000005 access violation (Windows)0xC0000005C4996 — MSVC: error C4996: 'strcpy': This function or variable may be unsafe. Consider using strcpy_s instead (C/C++)C4996terminate called without an active exception — C++: terminate called without an active exception — std::thread destroyed while joinable (C/C++)terminate called wi…no matching function for call to — C++: error: no matching function for call to 'f(int, const char*)' (C/C++)no matching functio…is private within this context — C++: error: 'int X::secret' is private within this context (C/C++)is private within t…GLIBCXX not found — Linux: version `GLIBCXX_3.4.30' not found (required by ./app) — libstdc++.so.6 (C/C++)GLIBCXX not foundC2065 — MSVC: error C2065: 'x': undeclared identifier (C/C++)C2065

Directly related (12)

SIGSEGVLinux

Segmentation fault (core dumped)

A program accessed memory it wasn’t allowed to, and the kernel killed it with SIGSEGV (exit code 139).

double free or corruptionC/C++

C/C++: free(): double free detected / double free or corruption (out) — Aborted (core dumped)

Memory was freed twice or the heap was corrupted (buffer overflow, freeing a non-heap pointer), so glibc aborted the program.

stack overflowC/C++

C/C++: stack overflow — infinite recursion or huge local array (Segmentation fault, 0xC00000FD)

The call stack ran out of space, typically from recursion that never stops or from a very large array declared as a local variabl…

control reaches end of non-void functionC/C++

C/C++: warning: control reaches end of non-void function [-Wreturn-type]

A function that promises a return value can finish without returning one on some path — undefined behaviour in C++.

implicit declaration of functionC/C++

C: warning: implicit declaration of function 'foo' [-Wimplicit-function-declaration]

In C you called a function the compiler has not seen declared — usually a missing `#include`. Newer compilers treat it as an erro…

Assertion failedC/C++

C/C++: Assertion `x > 0' failed. Aborted (core dumped) — assert() condition was false

An `assert()` in your code or in a library found its condition false and aborted the program on purpose.

Floating point exceptionC/C++

C/C++: Floating point exception (core dumped) — SIGFPE, usually integer division by zero

Despite the name, this is almost always an integer division or modulo by zero (or INT_MIN / -1); floating-point division by zero…

Bus errorC/C++

C/C++: Bus error (core dumped) — SIGBUS from misaligned access or a bad memory-mapped file

The CPU or OS rejected a memory access that is not a plain invalid address: misaligned data, or touching a memory-mapped file pag…

stack smashing detectedC/C++

C/C++: *** stack smashing detected ***: terminated — buffer overflow on the stack

GCC's stack protector noticed that a local buffer overflowed and overwrote the function's canary value, so it aborted the program.

std::bad_allocC/C++

C++: terminate called after throwing an instance of 'std::bad_alloc' — what(): std::bad_alloc

`new` or a container could not get the memory requested — either the system is out of memory or the size was absurdly large (ofte…

AddressSanitizer: heap-buffer-overflowC/C++

C/C++: ==ERROR: AddressSanitizer: heap-buffer-overflow on address — READ/WRITE of size N

AddressSanitizer caught a read or write just outside a heap block — an array index or length that is off by one or more.

AddressSanitizer: heap-use-after-freeC/C++

C/C++: ==ERROR: AddressSanitizer: heap-use-after-free on address — memory used after delete/free

The program read or wrote a heap block after it had been freed; ASan shows who freed it and where it was allocated.

Two steps away (25)

CrashLoopBackOffKubernetes

Kubernetes: CrashLoopBackOff

The container starts, crashes (or exits), and Kubernetes keeps restarting it with increasing back-off delays.

RangeErrorJavaScript

RangeError: Maximum call stack size exceeded

A function called itself (directly or indirectly) too many times — usually infinite recursion.

OOM killerLinux

Killed / Out of memory: Killed process (Linux OOM killer)

The kernel ran out of memory and killed a process to recover — the program just prints “Killed” (exit code 137).

OOMKilledKubernetes

Kubernetes: OOMKilled (exit code 137)

The container used more memory than its limit, and the kernel killed it.

OutOfMemoryErrorJava

java.lang.OutOfMemoryError: Java heap space

The JVM ran out of heap memory and garbage collection couldn’t free enough.

MEMORY_MANAGEMENTWindows

Blue Screen: MEMORY_MANAGEMENT (Stop code 0x0000001A)

Windows detected a severe memory-management error — commonly faulty RAM, unstable memory settings or a bad driver.

LeakSanitizer: detected memory leaksC/C++

C/C++: ==ERROR: LeakSanitizer: detected memory leaks — Direct leak of N byte(s)

At exit, LeakSanitizer found heap blocks that were allocated but never freed and are no longer reachable.

cannot declare variable to be of abstract typeC/C++

C++: error: cannot declare variable 'x' to be of abstract type 'Shape' (pure virtual functions)

You tried to create an object of a class that still has pure virtual functions; only a derived class that overrides all of them c…

comparison of integers of different signsC/C++

C/C++: warning: comparison of integer expressions of different signedness: 'int' and 'size_t' [-Wsign-compare]

A signed integer is compared with an unsigned one; the signed value is converted to unsigned, so a negative number becomes huge.

format expects argument of typeC/C++

C: warning: format '%d' expects argument of type 'int', but argument 2 has type 'long int' [-Wformat=]

The `printf`/`scanf` format specifier does not match the argument's type, which is undefined behaviour and prints garbage or cras…

undefined reference toC/C++

C/C++: undefined reference to `function' — collect2: error: ld returned 1 exit status

The linker can’t find the definition of a function or variable that was declared and used.

was not declared in this scopeC/C++

C++: error: 'x' was not declared in this scope (undeclared identifier)

The compiler met a name it has never seen: it is misspelled, declared later, out of scope, or its header or namespace is missing.

redefinition ofC/C++

C++: error: redefinition of 'class X' / multiple definition — missing include guard

The same class, struct or function body was included twice in one translation unit because the header has no include guard.

terminate called after throwing an instance ofC/C++

C++: terminate called after throwing an instance of 'std::out_of_range' — what(): vector::_M_range_check

A C++ exception wasn’t caught anywhere, so std::terminate aborted the program. what() tells you the reason.

call of overloaded is ambiguousC/C++

C++: error: call of overloaded 'f(int)' is ambiguous

Two or more overloads fit equally well, so the compiler refuses to guess which function you meant.

pure virtual method calledC/C++

C++: pure virtual method called — terminate called without an active exception

A pure virtual function was called on an object that is being constructed or destroyed, where the derived part no longer exists.

runtime error:C/C++

C/C++: runtime error: signed integer overflow / null pointer / shift exponent too large (UndefinedBehaviorSanitizer)

UBSan detected code that triggers undefined behaviour (overflow, null dereference, out-of-bounds index, bad shift, misaligned acc…

Cannot allocate memoryLinux

fork: Cannot allocate memory / ENOMEM

The kernel refused a memory allocation — RAM and swap are exhausted, or overcommit/cgroup limits block it.

0xC0000005Windows

The application was unable to start correctly (0xc0000005) / Exception code 0xc0000005 access violation

A program tried to read or write memory it doesn’t own and Windows stopped it — buggy software, bad drivers/plugins, security sof…

C4996C/C++

MSVC: error C4996: 'strcpy': This function or variable may be unsafe. Consider using strcpy_s instead

Visual C++ treats classic C library functions such as `strcpy`, `sprintf`, `fopen` and `scanf` as deprecated or unsafe and, with…

terminate called without an active exceptionC/C++

C++: terminate called without an active exception — std::thread destroyed while joinable

A `std::thread` object was destroyed (or reassigned) while its thread was still running, so the C++ runtime called `std::terminat…

no matching function for call toC/C++

C++: error: no matching function for call to 'f(int, const char*)'

No overload of the function accepts the arguments you passed — wrong count, wrong types, or a missing conversion.

is private within this contextC/C++

C++: error: 'int X::secret' is private within this context

Code outside the class tried to use a private (or protected) member.

GLIBCXX not foundC/C++

Linux: version `GLIBCXX_3.4.30' not found (required by ./app) — libstdc++.so.6

The program was built with a newer GCC than the libstdc++ installed on the machine where it runs.

C2065C/C++

MSVC: error C2065: 'x': undeclared identifier

Visual C++ met a name it has not seen declared — a typo, a missing header or namespace, or use outside its scope.