Error map

C2065 MSVC: error C2065: 'x': undeclared identifier

C/C++ · layer 4, Application & API

Open the full error page →

Centre: this error. First ring: errors it is linked with (7). Outer ring: what those are linked with. Colours show the layer of a request each error belongs to. Click any dot to re-centre the map on it; hover to follow its connections. The centre dot opens the error page.

C2065 — MSVC: error C2065: 'x': undeclared identifier (C/C++)C2065was not declared in this scope — C++: error: 'x' was not declared in this scope (undeclared identifier) (C/C++)was not declared in…call of overloaded is ambiguous — C++: error: call of overloaded 'f(int)' is ambiguous (C/C++)call of overloaded …cannot declare variable to be of abstract type — C++: error: cannot declare variable 'x' to be of abstract type 'Shape' (pure virtual functions) (C/C++)cannot declare vari…AddressSanitizer: heap-buffer-overflow — C/C++: ==ERROR: AddressSanitizer: heap-buffer-overflow on address — READ/WRITE of size N (C/C++)AddressSanitizer: h…AddressSanitizer: heap-use-after-free — C/C++: ==ERROR: AddressSanitizer: heap-use-after-free on address — memory used after delete/free (C/C++)AddressSanitizer: h…C4996 — MSVC: error C4996: 'strcpy': This function or variable may be unsafe. Consider using strcpy_s instead (C/C++)C4996LNK1104 — MSVC: fatal error LNK1104: cannot open file 'foo.lib' (or 'app.exe' while it is running) (C/C++)LNK1104undefined reference to — C/C++: undefined reference to `function' — collect2: error: ld returned 1 exit status (C/C++)undefined reference…expected ';' before — C/C++: error: expected ';' before 'x' — missing semicolon (C/C++)expected ';' beforeexpected primary-expression before — C++: error: expected primary-expression before ')' token (C/C++)expected primary-ex…E0308 — Rust: error[E0308]: mismatched types — expected `X`, found `Y` (Rust)E0308no match for 'operator' — C++: error: no match for 'operator<<' (operand types are 'std::ostream' and 'X') (C/C++)no match for 'opera…invalid conversion from — C++: error: invalid conversion from 'const char*' to 'char*' [-fpermissive] (C/C++)invalid conversion …use of deleted function — C++: error: use of deleted function 'X::X(const X&)' — copying a non-copyable type (C/C++)use of deleted func…no matching function for call to — C++: error: no matching function for call to 'f(int, const char*)' (C/C++)no matching functio…incomplete type — C++: error: invalid use of incomplete type 'class X' — forward declaration only (C/C++)incomplete typeMEMORY_MANAGEMENT — Blue Screen: MEMORY_MANAGEMENT (Stop code 0x0000001A) (Windows)MEMORY_MANAGEMENTSIGSEGV — Segmentation fault (core dumped) (Linux)SIGSEGVOOM killer — Killed / Out of memory: Killed process (Linux OOM killer) (Linux)OOM killerCannot allocate memory — fork: Cannot allocate memory / ENOMEM (Linux)Cannot allocate mem…0xC0000005 — The application was unable to start correctly (0xc0000005) / Exception code 0xc0000005 access violation (Windows)0xC0000005double free or corruption — C/C++: free(): double free detected / double free or corruption (out) — Aborted (core dumped) (C/C++)double free or corr…control reaches end of non-void function — C/C++: warning: control reaches end of non-void function [-Wreturn-type] (C/C++)control reaches end…comparison of integers of different signs — C/C++: warning: comparison of integer expressions of different signedness: 'int' and 'size_t' [-Wsign-compare] (C/C++)comparison of integ…format expects argument of type — C: warning: format '%d' expects argument of type 'int', but argument 2 has type 'long int' [-Wformat=] (C/C++)format expects argu…multiple definition of — C/C++: multiple definition of `x'; first defined here — ld returned 1 exit status (C/C++)multiple definition…undefined reference to vtable — C++: undefined reference to `vtable for X' — virtual function not defined (C/C++)undefined reference…undefined reference to main — C/C++: undefined reference to `main' — (.text+0x20) in crt1.o (C/C++)undefined reference…

Directly related (7)

was not declared in this scopeC/C++

C++: error: 'x' was not declared in this scope (undeclared identifier)

The compiler met a name it has never seen: it is misspelled, declared later, out of scope, or its header or namespace is missing.

call of overloaded is ambiguousC/C++

C++: error: call of overloaded 'f(int)' is ambiguous

Two or more overloads fit equally well, so the compiler refuses to guess which function you meant.

cannot declare variable to be of abstract typeC/C++

C++: error: cannot declare variable 'x' to be of abstract type 'Shape' (pure virtual functions)

You tried to create an object of a class that still has pure virtual functions; only a derived class that overrides all of them c…

AddressSanitizer: heap-buffer-overflowC/C++

C/C++: ==ERROR: AddressSanitizer: heap-buffer-overflow on address — READ/WRITE of size N

AddressSanitizer caught a read or write just outside a heap block — an array index or length that is off by one or more.

AddressSanitizer: heap-use-after-freeC/C++

C/C++: ==ERROR: AddressSanitizer: heap-use-after-free on address — memory used after delete/free

The program read or wrote a heap block after it had been freed; ASan shows who freed it and where it was allocated.

C4996C/C++

MSVC: error C4996: 'strcpy': This function or variable may be unsafe. Consider using strcpy_s instead

Visual C++ treats classic C library functions such as `strcpy`, `sprintf`, `fopen` and `scanf` as deprecated or unsafe and, with…

LNK1104C/C++

MSVC: fatal error LNK1104: cannot open file 'foo.lib' (or 'app.exe' while it is running)

The Visual C++ linker could not open an input library or the output file — the path is wrong, the library is missing, or the .exe…

Two steps away (21)

undefined reference toC/C++

C/C++: undefined reference to `function' — collect2: error: ld returned 1 exit status

The linker can’t find the definition of a function or variable that was declared and used.

expected ';' beforeC/C++

C/C++: error: expected ';' before 'x' — missing semicolon

The compiler reached a token where a statement should have ended — almost always a missing semicolon on the line above.

expected primary-expression beforeC/C++

C++: error: expected primary-expression before ')' token

The parser expected a value or expression and found a token that cannot start one — often a type name passed where a value belong…

E0308Rust

Rust: error[E0308]: mismatched types — expected `X`, found `Y`

A value’s type doesn’t match what the context expects — common with &str vs String, Option/Result vs plain values, and integer ty…

no match for 'operator'C/C++

C++: error: no match for 'operator<<' (operand types are 'std::ostream' and 'X')

You used an operator on a type that does not define it — most often printing your own class with `

invalid conversion fromC/C++

C++: error: invalid conversion from 'const char*' to 'char*' [-fpermissive]

C++ forbids silently dropping `const` or converting between unrelated pointer types — typically a string literal assigned to `cha…

use of deleted functionC/C++

C++: error: use of deleted function 'X::X(const X&)' — copying a non-copyable type

The code needs a function (usually a copy constructor or assignment) that was deleted explicitly or implicitly, as for `std::uniq…

no matching function for call toC/C++

C++: error: no matching function for call to 'f(int, const char*)'

No overload of the function accepts the arguments you passed — wrong count, wrong types, or a missing conversion.

incomplete typeC/C++

C++: error: invalid use of incomplete type 'class X' — forward declaration only

You used a class that has only been forward-declared (so its size and members are unknown) where the full definition is required.

MEMORY_MANAGEMENTWindows

Blue Screen: MEMORY_MANAGEMENT (Stop code 0x0000001A)

Windows detected a severe memory-management error — commonly faulty RAM, unstable memory settings or a bad driver.

SIGSEGVLinux

Segmentation fault (core dumped)

A program accessed memory it wasn’t allowed to, and the kernel killed it with SIGSEGV (exit code 139).

OOM killerLinux

Killed / Out of memory: Killed process (Linux OOM killer)

The kernel ran out of memory and killed a process to recover — the program just prints “Killed” (exit code 137).

Cannot allocate memoryLinux

fork: Cannot allocate memory / ENOMEM

The kernel refused a memory allocation — RAM and swap are exhausted, or overcommit/cgroup limits block it.

0xC0000005Windows

The application was unable to start correctly (0xc0000005) / Exception code 0xc0000005 access violation

A program tried to read or write memory it doesn’t own and Windows stopped it — buggy software, bad drivers/plugins, security sof…

double free or corruptionC/C++

C/C++: free(): double free detected / double free or corruption (out) — Aborted (core dumped)

Memory was freed twice or the heap was corrupted (buffer overflow, freeing a non-heap pointer), so glibc aborted the program.

control reaches end of non-void functionC/C++

C/C++: warning: control reaches end of non-void function [-Wreturn-type]

A function that promises a return value can finish without returning one on some path — undefined behaviour in C++.

comparison of integers of different signsC/C++

C/C++: warning: comparison of integer expressions of different signedness: 'int' and 'size_t' [-Wsign-compare]

A signed integer is compared with an unsigned one; the signed value is converted to unsigned, so a negative number becomes huge.

format expects argument of typeC/C++

C: warning: format '%d' expects argument of type 'int', but argument 2 has type 'long int' [-Wformat=]

The `printf`/`scanf` format specifier does not match the argument's type, which is undefined behaviour and prints garbage or cras…

multiple definition ofC/C++

C/C++: multiple definition of `x'; first defined here — ld returned 1 exit status

The linker found the same function or global variable defined in two object files — usually something defined in a header.

undefined reference to vtableC/C++

C++: undefined reference to `vtable for X' — virtual function not defined

The linker cannot find the class's virtual table, which means at least one virtual member function was declared but never defined…

undefined reference to mainC/C++

C/C++: undefined reference to `main' — (.text+0x20) in crt1.o

The linker has no `main` function: the file with `main` is not compiled or linked, or `main` is spelled or declared incorrectly.