Error map

RuntimeError dict RuntimeError: dictionary changed size during iteration

Python · layer 4, Application & API

Open the full error page →

Centre: this error. First ring: errors it is linked with (9). Outer ring: what those are linked with. Colours show the layer of a request each error belongs to. Click any dot to re-centre the map on it; hover to follow its connections. The centre dot opens the error page.

RuntimeError dict — RuntimeError: dictionary changed size during iteration (Python)RuntimeErro…UnsupportedOperationException — java.lang.UnsupportedOperationException (List.of / Arrays.asList is immutable) (Java)UnsupportedOperatio…ConnectionRefusedError — ConnectionRefusedError: [Errno 111] Connection refused (Python)ConnectionRefusedEr…ConcurrentModificationException — java.util.ConcurrentModificationException (Java)ConcurrentModificat…AttributeError — AttributeError: 'X' object has no attribute 'y' (Python)AttributeErrorTypeError not iterable — TypeError: x is not iterable (JavaScript)TypeError not itera…Event loop is closed — RuntimeError: Event loop is closed (Python)Event loop is closedIndex was out of range — ArgumentOutOfRangeException: Index was out of range. Must be non-negative and less than the size of the collection (.NET)Index was out of ra…Collection was modified — InvalidOperationException: Collection was modified; enumeration operation may not execute (.NET)Collection was modi…unhashable type — TypeError: unhashable type: 'list' (Python)unhashable typeArrayIndexOutOfBoundsException — java.lang.ArrayIndexOutOfBoundsException: Index 5 out of bounds for length 5 (Java)ArrayIndexOutOfBoun…ClassCastException — java.lang.ClassCastException: class A cannot be cast to class B (Java)ClassCastExceptionArithmeticException — java.lang.ArithmeticException: / by zero (Java)ArithmeticExceptionECONNREFUSED — Error: connect ECONNREFUSED 127.0.0.1:5432 (Node.js)ECONNREFUSED521 — Cloudflare Error 521: Web Server Is Down (Cloudflare)521ETIMEDOUT — API Request Timed Out (ETIMEDOUT / ReadTimeout / timeout of 30000ms exceeded) (API)ETIMEDOUTNullPointerException — java.lang.NullPointerException (Java)NullPointerExceptionOutOfMemoryError — java.lang.OutOfMemoryError: Java heap space (Java)OutOfMemoryErrorInterruptedException — java.lang.InterruptedException (sleep interrupted) (Java)InterruptedExceptionTypeError: not a function — TypeError: x is not a function (JavaScript)TypeError: not a fu…ImportError — ImportError: cannot import name 'x' from 'y' (Python)ImportErrorKeyError — KeyError: 'x' (Python)KeyErrorTypeError — TypeError: Cannot read properties of undefined (reading 'x') (JavaScript)TypeErrorTypeError set undefined — TypeError: Cannot set properties of undefined (setting 'x') (JavaScript)TypeError set undef…addEventListener on null — TypeError: Cannot read properties of null (reading 'addEventListener') (JavaScript)addEventListener on…UnhandledPromiseRejection — Node.js: [UnhandledPromiseRejection] — This error originated either by throwing inside of an async function without a catch block (Node.js)UnhandledPromiseRej…await outside async — SyntaxError: await is only valid in async functions and the top level bodies of modules (JavaScript)await outside asyncAbortError — AbortError: The user aborted a request. / signal is aborted without reason (JavaScript)AbortErrorSequence contains no elements — InvalidOperationException: Sequence contains no elements / more than one element (.NET)Sequence contains n…IllegalArgumentException — java.lang.IllegalArgumentException (Java)IllegalArgumentExce…IllegalStateException — java.lang.IllegalStateException (Java)IllegalStateExcepti…409 — HTTP 409 Conflict (HTTP)409412 — HTTP 412 Precondition Failed (HTTP)412428 — HTTP 428 Precondition Required (HTTP)428TypeError operand — TypeError: unsupported operand type(s) for +: 'int' and 'str' (Python)TypeError operandTypeError concat — TypeError: can only concatenate str (not "int") to str (Python)TypeError concatTypeError not callable — TypeError: 'str' object is not callable (Python)TypeError not calla…

Directly related (9)

Two steps away (27)

ArrayIndexOutOfBoundsExceptionJava

java.lang.ArrayIndexOutOfBoundsException: Index 5 out of bounds for length 5

Code accessed an array index outside 0 … length-1.

ClassCastExceptionJava

java.lang.ClassCastException: class A cannot be cast to class B

An object was cast to a type it isn’t.

ArithmeticExceptionJava

java.lang.ArithmeticException: / by zero

Integer division or modulo by zero.

ECONNREFUSEDNode.js

Error: connect ECONNREFUSED 127.0.0.1:5432

Nothing is listening at that host:port — the target service is down or you’re connecting to the wrong address.

521Cloudflare

Cloudflare Error 521: Web Server Is Down

Cloudflare couldn’t connect to your origin — the connection was refused.

ETIMEDOUTAPI

API Request Timed Out (ETIMEDOUT / ReadTimeout / timeout of 30000ms exceeded)

The client gave up waiting — either for the connection to open or for the response to arrive.

NullPointerExceptionJava

java.lang.NullPointerException

Code called a method or accessed a field on a reference that is `null`.

OutOfMemoryErrorJava

java.lang.OutOfMemoryError: Java heap space

The JVM ran out of heap memory and garbage collection couldn’t free enough.

InterruptedExceptionJava

java.lang.InterruptedException (sleep interrupted)

A blocked thread (sleep, wait, join, queue take) was interrupted by another thread.

TypeError: not a functionJavaScript

TypeError: x is not a function

You called something as a function, but its value is not a function (it’s undefined, a string, an object…).

ImportErrorPython

ImportError: cannot import name 'x' from 'y'

The module was found, but the name you’re importing from it doesn’t exist — usually a version change or a circular import.

KeyErrorPython

KeyError: 'x'

You accessed a dictionary key that doesn’t exist.

TypeErrorJavaScript

TypeError: Cannot read properties of undefined (reading 'x')

You tried to access a property on a value that is `undefined` (or `null`) — usually data that hasn’t loaded yet or a wrong proper…

TypeError set undefinedJavaScript

TypeError: Cannot set properties of undefined (setting 'x')

Code assigned a property on a value that is undefined (or null).

addEventListener on nullJavaScript

TypeError: Cannot read properties of null (reading 'addEventListener')

document.querySelector/getElementById returned null, so the element doesn’t exist when the script runs.

UnhandledPromiseRejectionNode.js

Node.js: [UnhandledPromiseRejection] — This error originated either by throwing inside of an async function without a catch block

A promise rejected and nothing handled it; since Node 15 this crashes the process.

await outside asyncJavaScript

SyntaxError: await is only valid in async functions and the top level bodies of modules

await was used inside a function that isn’t async (or in a classic, non-module script).

AbortErrorJavaScript

AbortError: The user aborted a request. / signal is aborted without reason

A fetch was cancelled through an AbortController (or the browser cancelled it).

Sequence contains no elements.NET

InvalidOperationException: Sequence contains no elements / more than one element

LINQ `First()`, `Single()`, `Last()` or `Max()` ran on an empty sequence (or `Single()` found several items).

IllegalArgumentExceptionJava

java.lang.IllegalArgumentException

A method rejected an argument value as invalid.

IllegalStateExceptionJava

java.lang.IllegalStateException

A method was called when the object wasn’t in the right state for it.

409HTTP

HTTP 409 Conflict

The request conflicts with the current state of the resource — e.g. a duplicate or an edit based on an outdated version.

412HTTP

HTTP 412 Precondition Failed

A conditional request header (If-Match, If-Unmodified-Since) didn’t match the current state of the resource.

428HTTP

HTTP 428 Precondition Required

The server requires a conditional request (If-Match / If-Unmodified-Since) to prevent lost updates, and you didn’t send one.

TypeError operandPython

TypeError: unsupported operand type(s) for +: 'int' and 'str'

An operator was used between two incompatible types, such as adding a number to a string.

TypeError concatPython

TypeError: can only concatenate str (not "int") to str

You joined a string and a non-string with +.

TypeError not callablePython

TypeError: 'str' object is not callable

You used parentheses on something that isn’t a function — often a variable shadowing a built-in.