Error map
No routes matched No routes matched location "/x"
React · layer 1, On your device
Centre: this error. First ring: errors it is linked with (12). Outer ring: what those are linked with. Colours show the layer of a request each error belongs to. Click any dot to re-centre the map on it; hover to follow its connections. The centre dot opens the error page.
Directly related (12)
HTTP 404 Not Found
The server can’t find anything at the requested URL.
Error: useNavigate() may be used only in the context of a <Router> component.
A React Router hook ran in a component that isn’t rendered inside a Router provider.
Cloudflare Error 1019: Compute server error (Workers)
A Cloudflare Worker routed the request to a loop or hit an internal compute error.
TypeError: Missing parameter name at 1 (path-to-regexp)
An Express 5 (path-to-regexp v8) route uses old wildcard syntax like '*' or '/:id?'.
API Error: Cannot GET /api/... / No route matches / The route could not be found
The server has no route for this URL and HTTP method combination — the endpoint path, API version prefix or method is wrong.
connect: Network is unreachable (ENETUNREACH)
The host has no route to the destination network — no default gateway, interface down, or trying IPv6 without IPv6 connectivity.
Whitelabel Error Page — This application has no explicit mapping for /error
Spring Boot’s default error page — the request hit no controller mapping (404) or a controller threw (500).
WordPress REST API: {"code":"rest_no_route","message":"No route was found matching the URL and request method."}
The REST endpoint doesn’t exist for that URL and HTTP method — wrong namespace/route, plugin not active, or route registered too…
Laravel: Symfony\Component\Routing\Exception\RouteNotFoundException: Route [login] not defined
Code called route('name') for a route name that doesn’t exist — very often route('login') from the auth middleware in API-only ap…
HTTP 405 Method Not Allowed
The URL exists, but it doesn’t accept the HTTP method you used (e.g. POST to a GET-only route).
Error: NextRouter was not mounted.
next/router’s useRouter was used inside the App Router (app/ directory), which uses next/navigation instead.
AmbiguousMatchException: The request matched multiple endpoints. Matches: X, Y
Two controller actions or minimal API endpoints have the same route and HTTP method.
Two steps away (36)
HTTP 403 Forbidden
The server understood the request but refuses to authorize it — you (or the server process) are not allowed to access this resour…
HTTP 410 Gone
The resource used to exist but was intentionally and permanently removed, with no forwarding address.
SyntaxError: Unexpected token < in JSON at position 0
`JSON.parse()` / `response.json()` received something that isn’t JSON — very often an HTML error page.
RuntimeError: Working outside of application context.
Code used current_app, g, or a Flask extension (like SQLAlchemy) without an active Flask application context.
Adjacent JSX elements must be wrapped in an enclosing tag. Did you want a JSX fragment <>...</>?
A component returns two sibling JSX elements without a single parent.
Warning: Cannot update a component (`Parent`) while rendering a different component (`Child`)
A child component updated a parent’s state during its render instead of in an effect or event handler.
Cloudflare Error 1025: Please check back later (Workers request limit)
The site’s Cloudflare Workers plan exceeded its daily request limit (free plan: 100,000 requests/day).
Cloudflare Error 1101: Worker threw exception
The Cloudflare Worker serving this route threw an uncaught JavaScript exception.
Cloudflare Error 1102: Worker exceeded resource limits (CPU time / memory)
The Worker used more CPU time or memory than its plan allows for a single request.
Error [ERR_HTTP_HEADERS_SENT]: Cannot set headers after they are sent to the client
An Express/Node handler tried to send a second response (or set headers) after one was already sent.
Express: req.body is undefined / {} (body parser missing)
Express didn’t parse the request body because no body-parsing middleware matched the request’s Content-Type.
TypeError: Router.use() requires a middleware function but got a Object
app.use()/router.use() received an object instead of a function — usually a router module that wasn’t exported.
URIError: URI malformed
decodeURIComponent/decodeURI received an invalid percent-encoded sequence.
API Error: Invalid or unsupported API version
The API version you requested — in the URL, a header or the SDK config — doesn’t exist or has been retired.
gRPC Error: 12 UNIMPLEMENTED: unknown service x / Method not found
The server doesn’t have the service or method the client called — proto mismatch, wrong package name, or calling the wrong server.
Error: socket hang up / read ECONNRESET
The other side closed the TCP connection abruptly while your client was still using it.
Error: getaddrinfo ENOTFOUND host / Name or service not known
DNS lookup for the hostname failed — the name is wrong, doesn’t exist, or this machine can’t resolve it.
ssh: connect to host x port 22: Connection refused
The server answered, but nothing is listening on the SSH port — sshd isn’t running, it uses another port, or a firewall actively…
HTTP 500 Internal Server Error
The server hit an unexpected condition — usually an unhandled exception or misconfiguration in the application.
UnsatisfiedDependencyException / NoSuchBeanDefinitionException: No qualifying bean of type 'X' available
Spring couldn’t find (or choose) a bean to inject.
The dependencies of some of the beans in the application context form a cycle
Two or more Spring beans depend on each other through constructors, and Spring Boot 2.6+ forbids cycles by default.
WordPress: Updating failed. The response is not a valid JSON response.
The block editor saved via the REST API but got HTML or an error page back — broken permalinks, a security plugin/WAF, or PHP out…
WordPress REST API: {"code":"rest_forbidden","message":"Sorry, you are not allowed to do that."} (401/403)
The REST request isn’t authenticated or the user lacks the capability required by the route’s permission_callback.
Site Health: The REST API encountered an error / Your site could not complete a loopback request (cURL error 28)
WordPress couldn’t call itself over HTTP — needed for the block editor, cron, plugin/theme editors and Site Health.
Git: Permission denied (publickey). fatal: Could not read from remote repository.
SSH authentication to GitHub/GitLab/Bitbucket failed — no key, wrong key, or the key isn’t added to your account.
Azure AD (Entra ID): AADSTS700016 Application not found in the directory
The client ID in your sign-in request doesn’t exist in the tenant you’re authenticating against.
HTTP 401 Unauthorized
The request has no valid authentication credentials — you need to log in or send a valid token.
HTTP 400 Bad Request
The server could not understand the request because its syntax, headers or body are malformed or invalid.
CORS Error: No 'Access-Control-Allow-Origin' header is present
The browser blocked a cross-origin request because the server’s response didn’t include the CORS headers allowing your site’s ori…
HTTP 501 Not Implemented
The server doesn’t support the functionality (usually the HTTP method) needed to fulfil the request.
Error: Hydration failed because the initial UI does not match what was rendered on the server
The HTML rendered on the server differs from the first client render, so React (Next.js/Remix) can’t attach to it.
You're importing a component that needs useState. It only works in a Client Component but none of its parents are marked with "use client"
In the Next.js App Router, a component using hooks or browser APIs is rendered as a Server Component.
Error: Dynamic server usage: Route /x couldn't be rendered statically because it used `cookies`
Next.js tried to statically render a route that reads request-specific data (cookies, headers, searchParams).
HTTP Error 500.19 - Internal Server Error: The requested page cannot be accessed because the related configuration data for the page is invalid
IIS can’t read web.config — usually the ASP.NET Core Hosting Bundle (AspNetCoreModuleV2) or URL Rewrite module isn’t installed, o…
error CS0246: The type or namespace name 'X' could not be found (are you missing a using directive or an assembly reference?)
The compiler doesn’t know the type — missing using, missing NuGet package/project reference, or a target framework mismatch.
error CS1061: 'X' does not contain a definition for 'Y' and no accessible extension method 'Y' accepting a first argument of type 'X' could be found
The member you call doesn’t exist on that type — typo, wrong type, missing using for an extension method, or an API removed in a…
Map another error
Popular: 4035004000xC000007BTypeErrorCritical error404NullPointerException