Error map

547 SQL Server: The INSERT statement conflicted with the FOREIGN KEY constraint 'x'. (Msg 547)

SQL · layer 5, Data

Open the full error page →

Centre: this error. First ring: errors it is linked with (8). Outer ring: what those are linked with. Colours show the layer of a request each error belongs to. Click any dot to re-centre the map on it; hover to follow its connections. The centre dot opens the error page.

547 — SQL Server: The INSERT statement conflicted with the FOREIGN KEY constraint 'x'. (Msg 547) (SQL)5478115 — SQL Server: Arithmetic overflow error converting expression to data type int. (Msg 8115) (SQL)8115544 — SQL Server: Cannot insert explicit value for identity column in table 'x' when IDENTITY_INSERT is set to OFF. (SQL)544245 — SQL Server: Conversion failed when converting the varchar value 'x' to data type int. (Msg 245) (SQL)245Execution Timeout Expired — SQL Server: Execution Timeout Expired. The timeout period elapsed prior to completion of the operation or the server is not responding. (SQL)Execution Timeout E…SQLite FK failed — sqlite3.IntegrityError: FOREIGN KEY constraint failed (SQL)SQLite FK failed102 — SQL Server: Incorrect syntax near 'x'. (Msg 102) (SQL)1021452 — MySQL ERROR 1452: Cannot add or update a child row: a foreign key constraint fails (MySQL)1452certificate chain not trusted — SQL Server: The certificate chain was issued by an authority that is not trusted. (SQL)certificate chain n…22003 — ERROR: numeric field overflow — A field with precision 5, scale 2 must round to an absolute value less than 10^3 (PostgreSQL)2200318456 — SQL Server: Login failed for user 'x'. (Error 18456) (SQL)18456208 — SQL Server: Invalid object name 'x'. (Msg 208) (SQL)208207 — SQL Server: Invalid column name 'x'. (Msg 207) (SQL)2072627 — SQL Server: Violation of PRIMARY KEY constraint 'x'. Cannot insert duplicate key in object 'y'. (Msg 2627) (SQL)26278152 / 2628 — SQL Server: String or binary data would be truncated in table 'x', column 'y'. (Msg 2628) (SQL)8152 / 262822P02 — ERROR: invalid input syntax for type integer: "abc" (PostgreSQL)22P02Network-related error — SQL Server: A network-related or instance-specific error occurred while establishing a connection to SQL Server. (provider: Named Pipes Provider, error: 40 / TCP Provider, error: 26) (SQL)Network-related err…ORA-01722 — ORA-01722: invalid number (SQL)ORA-01722Lock wait timeout — Lock wait timeout exceeded; try restarting transaction (MySQL 1205) (SQL)Lock wait timeout57014 — ERROR: canceling statement due to statement timeout (PostgreSQL)57014Endpoint request timed out — API Gateway: {"message": "Endpoint request timed out"} (504 after 29 seconds) (AWS)Endpoint request ti…SQLITE_BUSY — sqlite3.OperationalError: database is locked (SQLITE_BUSY) (SQL)SQLITE_BUSYSQLite no such column — sqlite3.OperationalError: no such column: x (SQL)SQLite no such colu…readonly database — sqlite3.OperationalError: attempt to write a readonly database (SQL)readonly database1064 — MySQL ERROR 1064 (42000): You have an error in your SQL syntax (MySQL)1064ambiguous column — Column reference is ambiguous / Column 'id' in field list is ambiguous (MySQL 1052) (SQL)ambiguous columnGROUP BY — Column must appear in the GROUP BY clause / isn't in GROUP BY (MySQL 1055 only_full_group_by) (SQL)GROUP BY1146 — MySQL ERROR 1146 (42S02): Table 'db.table' doesn't exist (MySQL)11461062 — MySQL ERROR 1062 (23000): Duplicate entry for key (MySQL)10621005 — MySQL ERROR 1005 (HY000): Can't create table (errno: 150 "Foreign key constraint is incorrectly formed") (MySQL)1005CERTIFICATE_VERIFY_FAILED — SSL: CERTIFICATE_VERIFY_FAILED / unable to get local issuer certificate (API)CERTIFICATE_VERIFY_…tlsv1 alert protocol version — SSL error: tlsv1 alert protocol version / unsupported protocol / no protocols available (API)tlsv1 alert protoco…Pending validation — ACM certificate stuck in Pending validation (AWS)Pending validation

Directly related (8)

Two steps away (24)

22003PostgreSQL

ERROR: numeric field overflow — A field with precision 5, scale 2 must round to an absolute value less than 10^3

A number doesn’t fit the column’s numeric(precision, scale) or integer range.

18456SQL

SQL Server: Login failed for user 'x'. (Error 18456)

SQL Server rejected the login — wrong password, wrong authentication mode, or a disabled/missing login.

208SQL

SQL Server: Invalid object name 'x'. (Msg 208)

The table/view doesn’t exist in the current database or schema.

207SQL

SQL Server: Invalid column name 'x'. (Msg 207)

SQL Server can’t find the column — typo, missing migration, or a string in double quotes with QUOTED_IDENTIFIER ON.

2627SQL

SQL Server: Violation of PRIMARY KEY constraint 'x'. Cannot insert duplicate key in object 'y'. (Msg 2627)

An insert duplicated a primary key or unique constraint value.

8152 / 2628SQL

SQL Server: String or binary data would be truncated in table 'x', column 'y'. (Msg 2628)

A value is longer than the column allows.

22P02PostgreSQL

ERROR: invalid input syntax for type integer: "abc"

A string couldn’t be converted to the column’s type (integer, numeric, boolean, date…).

Network-related errorSQL

SQL Server: A network-related or instance-specific error occurred while establishing a connection to SQL Server. (provider: Named Pipes Provider, error: 40 / TCP Provider, error: 26)

The client couldn’t reach the SQL Server instance — wrong server name/instance, TCP disabled, firewall, or SQL Browser not runnin…

ORA-01722SQL

ORA-01722: invalid number

Oracle tried to convert a string to a number and failed.

Lock wait timeoutSQL

Lock wait timeout exceeded; try restarting transaction (MySQL 1205)

A query waited too long for a row lock held by another transaction and gave up.

57014PostgreSQL

ERROR: canceling statement due to statement timeout

A query ran longer than statement_timeout and PostgreSQL cancelled it.

Endpoint request timed outAWS

API Gateway: {"message": "Endpoint request timed out"} (504 after 29 seconds)

The backend (usually Lambda) didn’t respond within API Gateway’s integration timeout (29 seconds by default for REST APIs).

SQLITE_BUSYSQL

sqlite3.OperationalError: database is locked (SQLITE_BUSY)

Another connection holds a write lock on the SQLite file, and this one gave up waiting.

SQLite no such columnSQL

sqlite3.OperationalError: no such column: x

SQLite can’t find the column — missing migration, typo, or a string written in double quotes.

readonly databaseSQL

sqlite3.OperationalError: attempt to write a readonly database

The process can’t write to the SQLite file or its directory.

1064MySQL

MySQL ERROR 1064 (42000): You have an error in your SQL syntax

MySQL couldn’t parse the query. The text after “near” shows where parsing failed.

ambiguous columnSQL

Column reference is ambiguous / Column 'id' in field list is ambiguous (MySQL 1052)

A column name exists in more than one joined table, so the database doesn’t know which one you mean.

GROUP BYSQL

Column must appear in the GROUP BY clause / isn't in GROUP BY (MySQL 1055 only_full_group_by)

You selected a column that is neither grouped nor aggregated, so the result would be ambiguous.

1146MySQL

MySQL ERROR 1146 (42S02): Table 'db.table' doesn't exist

The query references a table that MySQL can’t find in that database.

1062MySQL

MySQL ERROR 1062 (23000): Duplicate entry for key

An INSERT/UPDATE would create a duplicate value in a PRIMARY or UNIQUE key.

1005MySQL

MySQL ERROR 1005 (HY000): Can't create table (errno: 150 "Foreign key constraint is incorrectly formed")

A foreign key definition is invalid — the referenced column’s type, index or charset doesn’t match.

CERTIFICATE_VERIFY_FAILEDAPI

SSL: CERTIFICATE_VERIFY_FAILED / unable to get local issuer certificate

The client couldn’t verify the server’s TLS certificate chain, so it refused the HTTPS connection.

tlsv1 alert protocol versionAPI

SSL error: tlsv1 alert protocol version / unsupported protocol / no protocols available

The client and server couldn’t agree on a TLS version or cipher, so the HTTPS handshake failed before any HTTP was exchanged.

Pending validationAWS

ACM certificate stuck in Pending validation

ACM is waiting to see the DNS (or email) validation record — it wasn’t created, was created in the wrong DNS zone, or has a typo.